{"text_format":"3","workbook":"xlsx","n_sheets":2,"sheets":["Calcolo DM 140-12 + ORD. 108-20","Tabella-Z1"],"not_rendered":{"images":1,"macros":1,"defined_names":2},"read":"whole","date_system":"1900"}

{"sheet":"Calcolo DM 140-12 + ORD. 108-20","index":0,"n_rows":131,"n_cols":45,"rows_kept":131,"merged":[[0,1,0,5],[0,6,0,19],[1,1,1,5],[1,6,1,19],[2,1,2,5],[2,6,2,19],[3,1,3,19],[5,1,5,19],[5,39,10,44],[6,2,6,5],[6,6,6,7],[6,8,6,13],[6,14,6,19],[7,2,7,5],[7,6,7,7],[7,8,7,13],[7,14,7,19],[8,2,8,5],[8,6,8,7],[8,8,8,13],[8,14,8,19],[9,2,9,5],[9,6,9,7],[9,8,9,13],[9,14,9,19],[10,2,10,5],[10,6,10,7],[10,8,10,13],[10,14,10,19],[11,2,11,5],[11,6,11,7],[11,8,11,13],[11,14,11,19],[12,2,12,5],[12,6,12,7],[12,8,12,13],[12,14,12,19],[13,2,13,5],[13,6,13,7],[13,8,13,13],[13,14,13,19],[14,2,14,5],[14,6,14,7],[14,8,14,13],[14,14,14,19],[14,44,17,47],[15,2,15,5],[15,6,15,7],[15,8,15,13],[15,14,15,19],[17,1,17,19],[18,1,18,7],[19,1,19,7],[19,8,19,19],[20,1,20,7],[20,8,20,10],[20,11,20,13],[20,14,20,16],[20,17,20,19],[21,1,21,4],[21,8,21,10],[21,11,21,13],[21,14,21,16],[21,17,21,19],[22,1,22,4],[22,8,22,10],[22,11,22,13],[22,14,22,16],[22,17,22,19],[23,1,23,6],[23,8,23,10],[23,11,23,13],[23,14,23,16],[23,17,23,19],[23,23,26,23],[23,24,26,24],[23,25,26,25],[23,26,26,26],[23,27,26,27],[23,28,26,28],[23,29,26,29],[23,30,26,30],[24,1,25,4],[24,5,25,5],[24,6,25,6],[24,7,25,7],[24,8,24,10],[24,11,24,13],[24,14,24,16],[24,17,24,19],[25,8,25,10],[25,11,25,13],[25,14,25,16],[25,17,25,19],[27,8,27,19],[28,1,28,19],[28,23,28,30],[29,1,44,1],[29,2,44,2],[29,3,44,3],[29,4,44,4],[45,1,45,4],[45,5,45,6],[46,1,46,4],[46,5,46,6],[46,8,46,10],[46,11,46,13],[46,14,46,16],[46,17,46,19],[46,21,46,22],[47,1,47,6],[47,8,47,19],[49,1,49,19],[49,23,49,30],[50,1,70,1],[50,2,70,2],[50,3,70,3],[50,4,70,4],[60,8,60,10],[60,14,60,16],[60,17,60,19],[61,8,61,10],[61,14,61,16],[61,17,61,19],[62,8,62,10],[62,14,62,16],[62,17,62,19],[71,1,71,4],[71,5,71,6],[72,1,72,4],[72,5,72,6],[72,8,72,10],[72,11,72,13],[72,14,72,16],[72,17,72,19],[72,21,72,22],[73,1,73,6],[73,8,73,19],[75,1,75,19],[75,23,75,30],[76,1,82,1],[76,2,82,2],[76,3,82,3],[76,4,82,4],[83,1,83,4],[83,5,83,6],[84,1,84,4],[84,5,84,6],[84,8,84,10],[84,11,84,13],[84,14,84,16],[84,17,84,19],[84,21,84,22],[85,1,85,6],[85,8,85,19],[87,1,87,19],[87,23,87,30],[88,1,99,1],[88,2,99,2],[88,3,99,3],[88,4,99,4],[100,1,100,4],[100,5,100,6],[101,1,101,4],[101,5,101,6],[101,8,101,10],[101,11,101,13],[101,14,101,16],[101,17,101,19],[101,21,101,22],[102,1,102,6],[102,8,102,19],[104,1,104,19],[104,23,104,30],[105,1,109,1],[105,2,109,2],[105,3,109,3],[105,4,109,4],[105,17,105,19],[106,17,106,19],[107,8,107,10],[107,14,107,16],[107,17,107,19],[108,8,108,10],[108,11,108,13],[108,17,108,19],[109,17,109,19],[110,1,110,4],[110,5,110,6],[111,1,111,4],[111,5,111,6],[111,8,111,10],[111,11,111,13],[111,14,111,16],[111,17,111,19],[111,21,111,22],[112,1,112,6],[112,8,112,19],[114,1,114,6],[114,8,114,19],[115,1,115,6],[115,8,115,19],[116,1,116,6],[116,8,116,19],[117,1,117,6],[117,8,117,19],[118,1,118,6],[118,8,118,19],[119,1,119,6],[119,8,119,19],[121,1,121,6],[121,8,121,19],[123,1,123,6],[123,8,123,19],[124,1,124,4],[124,5,124,6],[124,10,124,19],[125,1,125,6],[125,8,125,19],[127,1,127,7],[127,8,127,19],[128,1,128,7],[128,8,128,19],[129,1,129,19],[130,1,130,19]]}
[null,"COMMITTENTE:"]
[null,"OGGETTO DELL'INCARICO:"]
[null,"DANNO:"]
[null,"CALCOLO DEI COMPENSI \nI compensi sono calcolati sulla base del D.M. GIUSTIZIA 20/07/2012, n. 140 \"Regolamento recante la determinazione dei parametri per la liquidazione da parte di un organo giurisdizionale dei compensi per le professioni regolamentate vigilate dal Ministero della giustizia, ai sensi dell’articolo 9 del decreto-legge 24 gennaio 2012 n. 1 convertito con modificazioni dalla legge 24 marzo 2012 n. 27.\"\nCosì come previsto dall'ordinanza 108/2020 del Commisario per la Ricostruzione post- sisma 2016"]
[]
[null,"RIPARTIZIONE DELL'ONORARIO FRA I SOGGETTI PREVISTI DALL'ORD. 108/2020",{"$nulls":37},"IMPOSTAZIONI STANDARD DELLE PRESTAZIONI.\nAll’utilizzatore rimane l’esclusiva responsabilità e il corretto impiego del programma, \nla consapevole interpretazione ed il necessario controllo dei risultati delle elaborazioni, \npertanto il produttore non potrà per nessun motivo essere ritenuto responsabile per alcun danno, diretto o indiretto, per mancati guadagni od altro in conseguenza dell’utilizzazione delle programma stesso."]
[null,null,"PROFESSIONISTA",{"$nulls":3},"TITOLO NOME E COGNOME",null,"ONORARIO",{"$nulls":5},"SPESE"]
[null,1,"COORDINATORE",{"$nulls":5},{"$f":"X128","v":{"v":0,"d":"0.00 €"}}]
[null,2,"DIRETTORE DEI LAVORI",{"$nulls":5},{"$f":"Y128","v":{"v":0,"d":"0.00 €"}}]
[null,3,"SPECIALISTICA 1",{"$nulls":5},{"$f":"Z128","v":{"v":0,"d":"0.00 €"}}]
[null,4,"SPECIALISTICA 2",{"$nulls":5},{"$f":"AA128","v":{"v":0,"d":"0.00 €"}}]
[null,5,"SICUREZZA PROGETTO",{"$nulls":5},{"$f":"AB128","v":{"v":0,"d":"0.00 €"}}]
[null,6,"SICUREZZA ESECUZIONE",{"$nulls":5},{"$f":"AC128","v":{"v":0,"d":"0.00 €"}}]
[null,7,"COLLAUDATORE",{"$nulls":5},{"$f":"AD128","v":{"v":0,"d":"0.00 €"}}]
[null,8,"GEOLOGO",{"$nulls":5},{"$f":"AE128","v":{"v":0,"d":"0.00 €"}},{"$nulls":35},"NB QUANDO SI VA IN STAMPA IMPOSTARE \"ADATTA TUTTE LE COLONNE SU UNA PAGINA\" "]
[null,null,"TOTALE",{"$nulls":5},{"$f":"SUM(I8:N15)","v":{"v":0,"d":"0.00 €"}},{"$nulls":5},{"$f":"I129","v":{"v":0,"d":"0.00 €"}}]
[]
[null,"in giallo le prestazioni \"standard\", in rosa le \"specialistiche\", in verde \"la sicurezza\" - come previsto da ord. 108/2020"]
[null,"IMPORTI DI RIFERIMENTO A BASE DI CALCOLO:"]
[null,"Editare le celle in azzuro",{"$nulls":6},"Categorie",{"$nulls":14},1,2,3,4,5,6,7,8]
[null,"Modalità di compilazione:\n- Inserire il valore delle opere per ciascuna categoria\n- Scegliere la destinazione funzionale delle opere\n- Inserire il grado di complessità \n- Digitare \"X\" nell'apposita colonna per attivare tutte le prestazioni\n- Inserire il progettista nella casella di fianco alla singola prestazione (numero d'ordine 1,2 ...)",{"$nulls":6},"Edilizia",null,null,"Strutture",null,null,"Impianti  1",null,null,"Impianti  2",{"$nulls":5},"COORDINATORE","DIRETTORE DEI LAVORI","SPECIALISTA 1","SPECIALISTA 2","SICUREZZA PROGETTO","SICUREZZA ESECUZIONE","COLLAUDATORE","GEOLOGO"]
[null,"Valore opera",{"$nulls":3},"V",{"$f":"CONCATENATE(\"Importo complessivo opere: \n€ \",TEXT(SUM(I22:T22),\"### ##0.00\"))","v":"Importo complessivo opere: \n€ 0.00"}]
[null,"Parametro",{"$nulls":3},"P",null,null,{"$f":"IF(I22<>0,0.03+10/POWER(I22,0.4),\"0\")","v":"0"},null,null,{"$f":"IF(L22<>0,0.03+10/POWER(L22,0.4),\"0\")","v":"0"},null,null,{"$f":"IF(O22<>0,0.03+10/POWER(O22,0.4),\"0\")","v":"0"},null,null,{"$f":"IF(R22<>0,0.03+10/POWER(R22,0.4),\"0\")","v":"0"}]
[null,"Destinazione funzionale delle opere",{"$nulls":5},"FLAG X =\nATTIVA TUTTE LE PRESTAZ.",{"$nulls":15},"COORDINATORE","DIRETTORE DEI LAVORI","SPECIALISTA 1","SPECIALISTA 2","SICUREZZA PROGETTO","SICUREZZA ESECUZIONE","COLLAUDATORE","GEOLOGO",{"$nulls":3},"---"]
[null,"Complessità",{"$nulls":3},"G","Grado di complessità (min-medio-max)",null,{"$f":"IF(I24<>\"\",VLOOKUP(I24,'Tabella-Z1'!$B$4:$F$11,5),\"\")","v":""},null,null,{"$f":"IF(L24<>\"\",VLOOKUP(L24,'Tabella-Z1'!$B$12:$F$14,5),\"\")","v":""},null,null,{"$f":"IF(O24<>\"\",VLOOKUP(O24,'Tabella-Z1'!$B$15:$F$20,5),\"\")","v":""},null,null,{"$f":"IF(R24<>\"\",VLOOKUP(R24,'Tabella-Z1'!$B$15:$F$20,5),\"\")","v":""},{"$nulls":16},"1. DEMOLIZIONE E RICOSTRUZIONE"]
[{"$nulls":34},"2. MIGLIORAMENTO/ADEGUAMENTO SISMICO"]
[{"$nulls":34},"3. MIGLIORAMENTO EDIFICIO VINCOLATO"]
[{"$nulls":8},"nella casella azzurra indicare il professionista autore della progettazione",{"$nulls":14},1,2,3,4,5,6,7,8,{"$nulls":3},"4. DANNI LIEVI - L0",{"$nulls":3},5]
[null,"PROGETTAZIONE PRELIMINARE",{"$nulls":21},"PROGETTAZIONE PRELIMINARE",{"$nulls":10},1,2,3,4,1]
[null,"PROGETTAZIONE","b.I)\nPROGETTAZIONE PRELIMINARE","prestazioni affidate","incidenza Q","QbI.01\nQpf.01","Relazioni, planimetrie, elaborati grafici (art.17, comma1, lettere a), b), e), d.P.R. 207/10)  ",null,null,{"$f":"IF($H30=\"x\",IF(AND(I30>0,I30<9),K30,0),0)","v":{"v":0,"d":"0.000"}},{"v":0.09,"d":"0.090"},null,{"$f":"IF($H30=\"x\",IF(AND(L30>0,L30<9),N30,0),0)","v":{"v":0,"d":"0.000"}},{"v":0.09,"d":"0.090"},null,{"$f":"IF($H30=\"x\",IF(AND(O30>0,O30<9),Q30,0),0)","v":{"v":0,"d":"0.000"}},{"v":0.09,"d":"0.090"},null,{"$f":"IF($H30=\"x\",IF(AND(R30>0,R30<9),T30,0),0)","v":{"v":0,"d":"0.000"}},{"v":0.09,"d":"0.090"},{"$nulls":3},{"$f":"IF(H30=\"X\",IF(I30=$X$20,ROUND(I$23*I$22*I$26*K30,2),0)+IF(L30=$X$20,ROUND(L$23*L$22*L$26*N30,2),0)+IF(O30=$X$20,ROUND(O$23*O$22*O$26*Q30,2),0)+IF(R30=$X$20,ROUND(R$23*R$22*R$26*T30,2),0),0)","v":{"v":0,"d":"0.00 €"}},{"$f":"IF(H30=\"X\",IF(I30=$Y$20,ROUND(I$23*I$22*I$26*K30,2),0)+IF(L30=$Y$20,ROUND(L$23*L$22*L$26*N30,2),0)+IF(O30=$Y$20,ROUND(O$23*O$22*O$26*Q30,2),0)+IF(R30=$Y$20,ROUND(R$23*R$22*R$26*T30,2),0),0)","v":{"v":0,"d":"0.00 €"}},{"$f":"IF(H30=\"X\",IF(I30=$Z$20,ROUND(I$23*I$22*I$26*K30,2),0)+IF(L30=$Z$20,ROUND(L$23*L$22*L$26*N30,2),0)+IF(O30=$Z$20,ROUND(O$23*O$22*O$26*Q30,2),0)+IF(R30=$Z$20,ROUND(R$23*R$22*R$26*T30,2),0),0)","v":{"v":0,"d":"0.00 €"}},{"$f":"IF(H30=\"X\",IF(I30=$AA$20,ROUND(I$23*I$22*I$26*K30,2),0)+IF(L30=$AA$20,ROUND(L$23*L$22*L$26*N30,2),0)+IF(O30=$AA$20,ROUND(O$23*O$22*O$26*Q30,2),0)+IF(R30=$AA$20,ROUND(R$23*R$22*R$26*T30,2),0),0)","v":{"v":0,"d":"0.00 €"}},{"$f":"IF(H30=\"X\",IF(I30=$AB$20,ROUND(I$23*I$22*I$26*K30,2),0)+IF(L30=$AB$20,ROUND(L$23*L$22*L$26*N30,2),0)+IF(O30=$AB$20,ROUND(O$23*O$22*O$26*Q30,2),0)+IF(R30=$AB$20,ROUND(R$23*R$22*R$26*T30,2),0),0)","v":{"v":0,"d":"0.00 €"}},{"$f":"IF(H30=\"X\",IF(I30=$AC$20,ROUND(I$23*I$22*I$26*K30,2),0)+IF(L30=$AC$20,ROUND(L$23*L$22*L$26*N30,2),0)+IF(O30=$AC$20,ROUND(O$23*O$22*O$26*Q30,2),0)+IF(R30=$AC$20,ROUND(R$23*R$22*R$26*T30,2),0),0)","v":{"v":0,"d":"0.00 €"}},{"$f":"IF(H30=\"X\",IF(I30=$AD$20,ROUND(I$23*I$22*I$26*K30,2),0)+IF(L30=$AD$20,ROUND(L$23*L$22*L$26*N30,2),0)+IF(O30=$AD$20,ROUND(O$23*O$22*O$26*Q30,2),0)+IF(R30=$AD$20,ROUND(R$23*R$22*R$26*T30,2),0),0)","v":{"v":0,"d":"0.00 €"}},{"$f":"IF(H30=\"X\",IF(I30=$AE$20,ROUND(I$23*I$22*I$26*K30,2),0)+IF(L30=$AE$20,ROUND(L$23*L$22*L$26*N30,2),0)+IF(O30=$AE$20,ROUND(O$23*O$22*O$26*Q30,2),0)+IF(R30=$AE$20,ROUND(R$23*R$22*R$26*T30,2),0),0)","v":{"v":0,"d":"0.00 €"}},{"$nulls":3},"X","X","X","X"]
[{"$nulls":5}," QbI.02  ","Calcolo sommario spesa, quadro economico di progetto (art.17, comma 1, lettere g), h), d.P.R. 207/10)  ",null,null,{"$f":"IF($H31=\"x\",IF(AND(I31>0,I31<9),K31,0),0)","v":{"v":0,"d":"0.000"}},{"v":0.01,"d":"0.010"},null,{"v":0,"d":"0.000"},{"v":0.01,"d":"0.010"},null,{"v":0,"d":"0.000"},{"v":0.01,"d":"0.010"},null,{"$f":"IF($H31=\"x\",IF(AND(R31>0,R31<9),T31,0),0)","v":{"v":0,"d":"0.000"}},{"v":0.01,"d":"0.010"},{"$nulls":3},{"v":0,"d":"0.00 €"},{"v":0,"d":"0.00 €"},{"v":0,"d":"0.00 €"},{"v":0,"d":"0.00 €"},{"v":0,"d":"0.00 €"},{"v":0,"d":"0.00 €"},{"v":0,"d":"0.00 €"},{"v":0,"d":"0.00 €"}]
[{"$nulls":5}," QbI.03  ","Piano economico e finanziario di massima (art.17, comma 4, d.P.R. 207/10 \u0081]art.164 D. lgs. 163/06 \u0081]art.1, comma 3, all.XXI)",null,null,{"v":0,"d":"0.000"},{"v":0.03,"d":"0.030"},null,{"v":0,"d":"0.000"},{"v":0.03,"d":"0.030"},null,{"v":0,"d":"0.000"},{"v":0.03,"d":"0.030"},null,{"v":0,"d":"0.000"},{"v":0.03,"d":"0.030"},{"$nulls":3},{"v":0,"d":"0.00 €"},{"v":0,"d":"0.00 €"},{"v":0,"d":"0.00 €"},{"v":0,"d":"0.00 €"},{"v":0,"d":"0.00 €"},{"v":0,"d":"0.00 €"},{"v":0,"d":"0.00 €"},{"v":0,"d":"0.00 €"}]
[{"$nulls":5}," QbI.04  ","Capitolato speciale descrittivo e prestazionale, schema di contratto (art.17, comma 3, lettere b), c), d.P.R. 207/10 \u0081]art.164, d.lgs. 163/06 \u0081]art.7, Allegato XXI)",null,null,{"v":0,"d":"0.000"},{"v":0.07,"d":"0.070"},null,{"v":0,"d":"0.000"},{"v":0.07,"d":"0.070"},null,{"v":0,"d":"0.000"},{"v":0.07,"d":"0.070"},null,{"v":0,"d":"0.000"},{"v":0.07,"d":"0.070"},{"$nulls":3},{"v":0,"d":"0.00 €"},{"v":0,"d":"0.00 €"},{"v":0,"d":"0.00 €"},{"v":0,"d":"0.00 €"},{"v":0,"d":"0.00 €"},{"v":0,"d":"0.00 €"},{"v":0,"d":"0.00 €"},{"v":0,"d":"0.00 €"}]
[{"$nulls":5}," QbI.05\nQps.02.01"," Relazione di indagine geotecnica (art.19, comma 1, d.P.R. 207/10)  ",null,null,{"v":0,"d":"0.000"},{"v":0.03,"d":"0.030"},null,{"v":0,"d":"0.000"},{"v":0.03,"d":"0.030"},null,{"v":0,"d":"0.000"},{"v":0.03,"d":"0.030"},null,{"v":0,"d":"0.000"},{"v":0.03,"d":"0.030"},{"$nulls":3},{"v":0,"d":"0.00 €"},{"v":0,"d":"0.00 €"},{"v":0,"d":"0.00 €"},{"v":0,"d":"0.00 €"},{"v":0,"d":"0.00 €"},{"v":0,"d":"0.00 €"},{"v":0,"d":"0.00 €"},{"v":0,"d":"0.00 €"},{"$nulls":3},"X","X","X"]
[{"$nulls":5}," QbI.06  "," Relazione di indagine idrologica (art.19, comma 1, d.P.R. 207/10)  ",null,null,{"v":0,"d":"0.000"},0.015,null,{"v":0,"d":"0.000"},0.015,null,{"v":0,"d":"0.000"},0.015,null,{"v":0,"d":"0.000"},0.015,{"$nulls":3},{"v":0,"d":"0.00 €"},{"v":0,"d":"0.00 €"},{"v":0,"d":"0.00 €"},{"v":0,"d":"0.00 €"},{"v":0,"d":"0.00 €"},{"v":0,"d":"0.00 €"},{"v":0,"d":"0.00 €"},{"v":0,"d":"0.00 €"}]
[{"$nulls":5}," QbI.07\nQps.04.01"," Relazione di indagine idraulica (art.19, comma 1, d.P.R. 207/10)  ",null,null,{"v":0,"d":"0.000"},0.015,null,{"v":0,"d":"0.000"},0.015,null,{"v":0,"d":"0.000"},0.015,null,{"v":0,"d":"0.000"},0.015,{"$nulls":3},{"v":0,"d":"0.00 €"},{"v":0,"d":"0.00 €"},{"v":0,"d":"0.00 €"},{"v":0,"d":"0.00 €"},{"v":0,"d":"0.00 €"},{"v":0,"d":"0.00 €"},{"v":0,"d":"0.00 €"},{"v":0,"d":"0.00 €"}]
[{"$nulls":5}," QbI.08\nQps.05.01"," Relazione di indagine sismica (art.19, comma 1, d.P.R. 207/10)  ",null,null,{"v":0,"d":"0.000"},0.015,null,{"v":0,"d":"0.000"},0.015,null,{"v":0,"d":"0.000"},0.015,null,{"v":0,"d":"0.000"},0.015,{"$nulls":3},{"v":0,"d":"0.00 €"},{"v":0,"d":"0.00 €"},{"v":0,"d":"0.00 €"},{"v":0,"d":"0.00 €"},{"v":0,"d":"0.00 €"},{"v":0,"d":"0.00 €"},{"v":0,"d":"0.00 €"},{"v":0,"d":"0.00 €"},{"$nulls":3},"X","X","X"]
[{"$nulls":5},"QbI.09  \nQps.09"," Relazione di indagine archeologica (art.19, comma 1, d.P.R. 207/10)  ",null,null,{"v":0,"d":"0.000"},0.015,null,{"v":0,"d":"0.000"},0.015,null,{"v":0,"d":"0.000"},0.015,null,{"v":0,"d":"0.000"},0.015,{"$nulls":3},{"v":0,"d":"0.00 €"},{"v":0,"d":"0.00 €"},{"v":0,"d":"0.00 €"},{"v":0,"d":"0.00 €"},{"v":0,"d":"0.00 €"},{"v":0,"d":"0.00 €"},{"v":0,"d":"0.00 €"},{"v":0,"d":"0.00 €"}]
[{"$nulls":5}," QbI.10\nQps.10.01"," Relazione di indagine geologica (art.19, comma 1, d.P.R. 207/10)  ",null,{"$f":"IF(H39=\"X\",8,\"\")","v":""},{"v":0,"d":"0.000"},{"v":0.05,"d":"0.050"},{"$f":"IF(I39=\"\",\"\",I39)","v":""},{"v":0,"d":"0.000"},{"v":0.05,"d":"0.050"},{"$f":"IF(H39=\"X\",8,\"\")","v":""},{"v":0,"d":"0.000"},{"v":0.05,"d":"0.050"},{"$f":"IF(H39=\"X\",8,\"\")","v":""},{"v":0,"d":"0.000"},{"v":0.05,"d":"0.050"},{"$nulls":3},{"v":0,"d":"0.00 €"},{"v":0,"d":"0.00 €"},{"v":0,"d":"0.00 €"},{"v":0,"d":"0.00 €"},{"v":0,"d":"0.00 €"},{"v":0,"d":"0.00 €"},{"v":0,"d":"0.00 €"},{"v":0,"d":"0.00 €"},{"$nulls":3},"X","X","X"]
[{"$nulls":5}," QbI.11  "," Progettazione integrale e coordinata \u0081- Integrazione delle prestazioni specialistiche (art.90, comma 7, d.lgs. 163/06) . Relazione tecno\u0081]alimentare  ",null,null,{"v":0,"d":"0.000"},{"v":0.02,"d":"0.020"},null,{"v":0,"d":"0.000"},{"v":0.02,"d":"0.020"},null,{"v":0,"d":"0.000"},{"v":0.02,"d":"0.020"},null,{"v":0,"d":"0.000"},{"v":0.02,"d":"0.020"},{"$nulls":3},{"v":0,"d":"0.00 €"},{"v":0,"d":"0.00 €"},{"v":0,"d":"0.00 €"},{"v":0,"d":"0.00 €"},{"v":0,"d":"0.00 €"},{"v":0,"d":"0.00 €"},{"v":0,"d":"0.00 €"},{"v":0,"d":"0.00 €"}]
{"$rows_left_out":92}
{"sheet":"Tabella-Z1","index":1,"n_rows":38,"n_cols":18,"rows_kept":38,"hidden":true,"merged":[[0,0,0,3],[1,0,2,0],[1,1,2,1],[1,2,1,3],[3,0,10,0],[11,0,13,0],[14,0,19,0],[20,0,23,0],[24,0,25,0],[26,0,28,0],[29,0,32,0],[33,0,36,0]]}
["TAVOLA Z-1 “CATEGORIE DELLE OPERE E PARAMETRO DEL GRADO DI COMPLESSITA’”"]
["CATEGORIA D'OPERA","DESTINAZIONE FUNZIONALE DELLE OPERE","Grado di complessità G"]
[null,null,"Ridotto ","Elevato","media","Nota",null,null,1,2,3,4,5,6,7,8,9,10]
["EDILIZIA","E1-INSEDIAMENTI PRODUTTIVI PER L'AGRICOLTURA, L'INDUSTRIA, L'ARTIGIANATO-DEPOSITI",0.7,{"v":1,"d":"1.0"},{"$f":"AVERAGE(C4:D4)","v":{"v":0.85,"d":"0.9"}},{"$f":"CONCATENATE(\"(\",C4,\"-\",E4,\"-\",D4,\")\")","v":"(0.7-0.85-1)"},null,"E1",0.7,0.8,0.9,{"v":1,"d":"1.0"}]
[null,"E2-INDUSTRIA ALBERGHIERA, TURISMO E COMMERCIO E SERVIZI PER LA MOBILITA'",{"v":1,"d":"1.0"},1.3,{"$f":"AVERAGE(C5:D5)","v":{"v":1.15,"d":"1.2"}},{"$f":"CONCATENATE(\"(\",C5,\"-\",E5,\"-\",D5,\")\")","v":"(1-1.15-1.3)"},null,"E2",{"v":1,"d":"1.0"},1.1,1.2,1.3]
[null,"E3-RESIDENZA",0.7,1.3,{"v":1,"d":"1.0"},"(0.7-1-1.3)",null,"E3",0.7,0.8,0.9,{"v":1,"d":"1.0"},1.1,1.2,1.3]
[null,"E4-SANITA', ISTRUZIONE, RICERCA",{"v":1,"d":"1.0"},1.3,{"v":1.15,"d":"1.2"},"(1-1.15-1.3)",null,"E4",{"v":1,"d":"1.0"},1.1,1.2,1.3]
[null,"E5-CULTURA, VITA SOCIALE, SPORT, CULTO",{"v":1,"d":"1.0"},1.3,{"v":1.15,"d":"1.2"},"(1-1.15-1.3)",null,"E5",{"v":1,"d":"1.0"},1.1,1.2,1.3]
[null,"E6-SEDI AMMINISTRATIVE, GIUDIZIARIE, DELLE FORZE DELL'ORDINE",0.7,1.3,{"v":1,"d":"1.0"},"(0.7-1-1.3)",null,"E6",0.7,0.8,0.9,{"v":1,"d":"1.0"},1.1,1.2,1.3]
[null,"E7-ARREDI, FORNITURE, AREE ESTERNE PERTINENZIALI ALLESTITE",{"v":1,"d":"1.0"},1.3,{"v":1.15,"d":"1.2"},"(1-1.15-1.3)",null,"E7",{"v":1,"d":"1.0"},1.1,1.2,1.3]
[null,"E8-INTERVENTI SU EDIFICI E MANUFATTI DI RILEVANTE INTERESSE STORICO-ARTISTICO E MONUMENTALE",1.3,1.6,{"v":1.4500000000000002,"d":"1.5"},"(1.3-1.45-1.6)",null,"E8",1.3,1.4,1.5,1.6]
["STRUTTURE","S1-STRUTTURE, OPERE INFRASTRUTTURALI PUNTUALI, VERIFICHE NON SOGGETTE AD AZIONI SISMICHE",0.8,{"v":1,"d":"1.0"},0.9,"(0.8-0.9-1)",null,"S1",0.8,0.9,{"v":1,"d":"1.0"}]
[null,"S2-STRUTTURE, OPERE INFRASTRUTTURALI PUNTUALI, VERIFICHE SOGGETTE AD AZIONI SISMICHE ",{"v":1,"d":"1.0"},1.2,1.1,"(1-1.1-1.2)",null,"S2",{"v":1,"d":"1.0"},1.1,1.2]
[null,"S3-STRUTTURE SPECIALI",1.2,1.3,{"v":1.25,"d":"1.3"},"(1.2-1.25-1.3)",null,"S3",1.2,1.3]
["IMPIANTI","I1-IMPIANTI MECCANICI A FLUIDO A SERVIZIO DELLE COSTRUZIONI",0.8,1.1,{"v":0.9500000000000001,"d":"1.0"},"(0.8-0.95-1.1)",null,"I1",0.8,0.9,{"v":1,"d":"1.0"},1.1]
[null,"I2-IMPIANTI ELETTRICI E SPECIALI A SERVIZIO DELLE COSTRUZIONI – SINGOLE APPARECCHIATURE PER LABORATORI E IMPIANTI PILOTA",1.1,1.3,{"v":1.2000000000000002,"d":"1.2"},"(1.1-1.2-1.3)",null,"I2",1.1,1.2,1.3]
[null,"I3-IMPIANTI INDUSTRIALI - IMPIANTI PILOTA E IMPIANTI DI DEPURAZIONE CON RIDOTTE PROBLEMATICHE TECNICHE-DISCARICHE INERTI",0.6,0.8,0.7,"(0.6-0.7-0.8)",null,"I3",0.6,0.7,0.8]
[null,"I4-IMPIANTI INDUSTRIALI – IMPIANTI PILOTA E IMPIANTI DI DEPURAZIONE COMPLESSI-DISCARICHE CON TRATTAMENTI E TERMOVALORIZZATORI",0.8,1.2,{"v":1,"d":"1.0"},"(0.8-1-1.2)",null,"I4",0.8,0.9,{"v":1,"d":"1.0"},1.1,1.2]
[null,"I5-OPERE ELETTRICHE PER RETI DI TRASMISSIONE E DISTRIBUZIONE ENERGIA E SEGNALI – LABORATORI CON TRATTAMENTI E TERMOVALORIZZATORI",0.6,0.9,{"v":0.75,"d":"0.8"},"(0.6-0.75-0.9)",null,"I5",0.6,0.7,0.8,0.9]
[null,"I6-IMPANTI PER LA PRODUZIONE DI ENERGIA – LABORATORI COMPLESSI",0.9,1.1,{"v":1,"d":"1.0"},"(0.9-1-1.1)",null,"I6",0.9,{"v":1,"d":"1.0"},1.1]
["VIABILITA'","V1-MANUTENZIONE",0.4,0.5,{"v":0.45,"d":"0.5"},"(0.4-0.45-0.5)",null,"V1",0.4,0.5]
[null,"V2-VIABILITA' ORDINARIA",0.5,0.7,0.6,"(0.5-0.6-0.7)",null,"V2",0.5,0.6,0.7]
[null,"V3-NAVIGAZIONE INTERNA",0.7,0.9,0.8,"(0.7-0.8-0.9)",null,"V3",0.7,0.8,0.9]
[null,"V4-VIABILITA' SPECIALE",0.9,{"v":1,"d":"1.0"},{"v":0.95,"d":"1.0"},"(0.9-0.95-1)",null,"V4",0.9,{"v":1,"d":"1.0"}]
["IDRAULICA","D1-OPERE DI BONIFICA E DERIVAZIONI",0.4,0.6,0.5,"(0.4-0.5-0.6)",null,"D1",0.4,0.5,0.6]
[null,"D2-ACQUEDOTTI E FOGNATURE",0.6,0.8,0.7,"(0.6-0.7-0.8)",null,"D2",0.6,0.7,0.8]
["TIC","T1-SISTEMI INFORMATIVI",0.9,1.1,{"v":1,"d":"1.0"},"(0.9-1-1.1)",null,"T1",0.9,{"v":1,"d":"1.0"},1.1]
[null,"T2-SISTEMI E RETI DI TELECOMUNICAZIONE",0.7,0.9,0.8,"(0.7-0.8-0.9)",null,"T2",0.7,0.8,0.9]
[null,"T3-SISTEMI ELETTRONICI ED AUTOMAZIONE",1.1,1.3,{"v":1.2000000000000002,"d":"1.2"},"(1.1-1.2-1.3)",null,"T3",1.1,1.2,1.3]
["PAESAGGIO, AMBIENTE, NATURALIZZAZIONE","P1-INTERVENTI DI SISTEMAZIONE NATURALISTICA O PAESAGGISTICA",0.8,1.2,{"v":1,"d":"1.0"},"(0.8-1-1.2)",null,"P1",0.8,0.9,{"v":1,"d":"1.0"},1.1,1.2]
[null,"P2-INTERVENTI DEL VERDE E OPERE PER ATTIVITÀ RICREATIVA O SPORTIVA",0.7,1.1,0.9,"(0.7-0.9-1.1)",null,"P2",0.7,0.8,0.9,{"v":1,"d":"1.0"},1.1]
[null,"P3-INTERVENTI RECUPERO, RIQUALIFICAZIONE AMBIENTALE",0.9,1.3,1.1,"(0.9-1.1-1.3)",null,"P3",0.9,{"v":1,"d":"1.0"},1.1,1.2,1.3]
[null,"P4-INTERVENTI DI SFRUTTAMENTO DI CAVE E TORBIERE",0.8,1.3,{"v":1.05,"d":"1.1"},"(0.8-1.05-1.3)",null,"P4",0.8,0.9,{"v":1,"d":"1.0"},1.1,1.2,1.3]
["AGRICOLTURA E FORESTE, SICUREZZA ALIMENTARE","A1-INTERVENTI DI MIGLIORAMENTO E QUALIFICAZIONE DELLA FILIERA FORESTALE",0.7,1.2,{"v":0.95,"d":"1.0"},"(0.7-0.95-1.2)",null,"A1",0.7,0.8,0.9,{"v":1,"d":"1.0"},1.1,1.2]
[null,"A2-INTERVENTI DI MIGLIORAMENTO FONDIARIO AGRARIO E RURALE; INTERVENTI DI PIANIFICAZIONE ALIMENTARE",0.9,1.3,1.1,"(0.9-1.1-1.3)",null,"A2",0.9,{"v":1,"d":"1.0"},1.1,1.2,1.3]
[null,"A3-INTERVENTI PER LA VALORIZZAZIONE DELLE FILIERE PRODUTTIVE AGROALIMENTARI E ZOOTECNICHE; INTERVENTI DI CONTROLLO – VIGILANZA ALIMENTARE",0.8,1.2,{"v":1,"d":"1.0"},"(0.8-1-1.2)",null,"A3",0.8,0.9,{"v":1,"d":"1.0"},1.1,1.2]
[null,"A4-INTERVENTI PER LA VALORIZZAZIONE DELLA FILIERA NATURALISTICA E FAUNISTICA",0.7,1.6,{"v":1.15,"d":"1.2"},"(0.7-1.15-1.6)",null,"A4",0.7,0.8,0.9,{"v":1,"d":"1.0"},1.1,1.2,1.3,1.4,1.5,1.6]
["TERRITORIO E URBANISTICA","U1-INTERVENTI DI PIANIFICAZIONE",0.8,1.5,{"v":1.15,"d":"1.2"},"(0.8-1.15-1.5)",null,"U1",0.8,0.9,{"v":1,"d":"1.0"},1.1,1.2,1.3,1.4,1.5]