{"text_format":"3","workbook":"xlsx","n_sheets":6,"sheets":["ISTRUZIONI","Calcolo DM 140-12 + ORD. 108-20","DIVISIONE PER PROFESSIONISTA","DIVISIONE PER CATEGORIA","CONSEGNA UFFICI","Tabella-Z1"],"not_rendered":{"images":1,"macros":1,"defined_names":6},"read":"whole","date_system":"1900"}

{"sheet":"ISTRUZIONI","index":0,"n_rows":131,"n_cols":24,"rows_kept":131}
["ISTRUZIONI PER LA COMPILAZIONE"]
[]
["1. LA PARCELLA DEVE ESSERE COMPILATA NEL FOGLIO \"CALCOLO DM 140-12 + ORD. 108-20\""]
["2. I FLAG CONGLIATI NON SONO OBBLIGATORI, OGNI PRESTAZIONE PUO' ESSERE \n    GIUSTIFICATA DAL PROGETTISTA"]
["3. LE PRESTAZIONI PREVISTE DALLA ORDINANZA 108-20 SONO QUELLE COLORATE"]
["4. LE SINGOLE PRESTAZIONI POI DEVONO ESSERE ATTIVATE INSERENDO \n     IL \"NUMERO DA 1 A 8\" RELATIVO AL PROFESSIONISTA CHE L'HA EFFETTUATA"]
["5. GLI ALTRI 3 FOGLI SONO A SERVIZIO DEL PROFESSIONISTA E PER LA STAMPA"]
["6. SI CONSIGLIA DI CONSEGNARE AGLI UFFICI LA SOLA ULTIMA SCHEDA \"CONSEGNA UFFICI\" \n    DOVE SONO ELIMINATI I RIFERIMENTI AI VARI PROFESSONISTI INCARICATI"]
["7. NEL PASSAGGIO AL FOGLIO \"CONSEGNA UFFICI\" VERRANNO ELIMINATE\n    LE RIGHE NON UTILIZZATE - ATTENDERE LA COMPILAZIONE DEL FOGLIO"]
{"$rows_empty":121}
[{"$nulls":21},false,"."," "]

{"sheet":"Calcolo DM 140-12 + ORD. 108-20","index":1,"n_rows":148,"n_cols":45,"rows_kept":148,"merged":[[0,1,0,5],[0,6,0,19],[1,1,1,5],[1,6,1,19],[2,1,2,5],[2,6,2,19],[3,1,3,19],[5,1,5,19],[5,39,10,44],[6,2,6,5],[6,6,6,7],[6,8,6,13],[6,14,6,19],[7,2,7,5],[7,6,7,7],[7,8,7,13],[7,14,7,19],[8,2,8,5],[8,6,8,7],[8,8,8,13],[8,14,8,19],[9,2,9,5],[9,6,9,7],[9,8,9,13],[9,14,9,19],[10,2,10,5],[10,6,10,7],[10,8,10,13],[10,14,10,19],[11,2,11,5],[11,6,11,7],[11,8,11,13],[11,14,11,19],[12,2,12,5],[12,6,12,7],[12,8,12,13],[12,14,12,19],[13,2,13,5],[13,6,13,7],[13,8,13,13],[13,14,13,19],[14,2,14,5],[14,6,14,7],[14,8,14,13],[14,14,14,19],[14,44,17,47],[15,2,15,5],[15,6,15,7],[15,8,15,13],[15,14,15,19],[17,1,17,19],[18,1,18,7],[19,1,19,7],[19,8,19,19],[20,1,20,7],[20,8,20,10],[20,11,20,13],[20,14,20,16],[20,17,20,19],[21,1,21,4],[21,8,21,10],[21,11,21,13],[21,14,21,16],[21,17,21,19],[22,1,22,4],[22,8,22,10],[22,11,22,13],[22,14,22,16],[22,17,22,19],[23,1,23,6],[23,8,23,10],[23,11,23,13],[23,14,23,16],[23,17,23,19],[23,20,28,20],[23,23,26,23],[23,24,26,24],[23,25,26,25],[23,26,26,26],[23,27,26,27],[23,28,26,28],[23,29,26,29],[23,30,26,30],[24,1,25,4],[24,5,25,5],[24,6,25,6],[24,7,25,7],[24,8,24,10],[24,11,24,13],[24,14,24,16],[24,17,24,19],[25,8,25,10],[25,11,25,13],[25,14,25,16],[25,17,25,19],[27,1,27,19],[28,1,28,19],[28,23,28,30],[29,1,44,1],[29,2,44,2],[29,3,44,3],[29,4,44,4],[45,1,45,4],[45,5,45,6],[46,1,46,4],[46,5,46,6],[46,8,46,10],[46,11,46,13],[46,14,46,16],[46,17,46,19],[46,21,46,22],[47,1,47,6],[47,8,47,19],[49,1,49,19],[49,23,49,30],[50,1,70,1],[50,2,70,2],[50,3,70,3],[50,4,70,4],[60,8,60,10],[60,14,60,16],[60,17,60,19],[61,8,61,10],[61,14,61,16],[61,17,61,19],[62,8,62,10],[62,14,62,16],[62,17,62,19],[71,1,71,4],[71,5,71,6],[72,1,72,4],[72,5,72,6],[72,8,72,10],[72,11,72,13],[72,14,72,16],[72,17,72,19],[72,21,72,22],[73,1,73,6],[73,8,73,19],[75,1,75,19],[75,23,75,30],[76,1,82,1],[76,2,82,2],[76,3,82,3],[76,4,82,4],[83,1,83,4],[83,5,83,6],[84,1,84,4],[84,5,84,6],[84,8,84,10],[84,11,84,13],[84,14,84,16],[84,17,84,19],[84,21,84,22],[85,1,85,6],[85,8,85,19],[87,1,87,19],[87,23,87,30],[88,1,99,1],[88,2,99,2],[88,3,99,3],[88,4,99,4],[100,1,100,4],[100,5,100,6],[101,1,101,4],[101,5,101,6],[101,8,101,10],[101,11,101,13],[101,14,101,16],[101,17,101,19],[101,21,101,22],[102,1,102,6],[102,8,102,19],[104,1,104,19],[104,23,104,30],[105,1,109,1],[105,2,109,2],[105,3,109,3],[105,4,109,4],[105,17,105,19],[106,17,106,19],[107,8,107,10],[107,14,107,16],[107,17,107,19],[108,8,108,10],[108,11,108,13],[108,17,108,19],[109,17,109,19],[110,1,110,4],[110,5,110,6],[111,1,111,4],[111,5,111,6],[111,8,111,10],[111,11,111,13],[111,14,111,16],[111,17,111,19],[111,21,111,22],[112,1,112,6],[112,8,112,19],[114,1,114,6],[114,8,114,19],[115,1,115,6],[115,8,115,19],[116,1,116,6],[116,8,116,19],[117,1,117,6],[117,8,117,19],[118,1,118,6],[118,8,118,19],[119,1,119,6],[119,8,119,19],[121,1,121,6],[121,8,121,19],[123,1,123,6],[123,8,123,19],[124,1,124,4],[124,5,124,6],[124,10,124,19],[125,1,125,6],[125,8,125,19],[127,1,127,7],[127,8,127,19],[128,1,128,7],[128,8,128,19],[129,1,129,19],[130,1,130,19],[132,8,132,10],[132,11,132,13],[132,14,132,16],[132,17,132,19],[133,1,133,6],[133,8,133,10],[133,11,133,13],[133,14,133,16],[133,17,133,19],[134,1,134,6],[134,8,134,10],[134,11,134,13],[134,14,134,16],[134,17,134,19],[135,1,135,6],[135,8,135,10],[135,11,135,13],[135,14,135,16],[135,17,135,19],[136,1,136,6],[136,8,136,10],[136,11,136,13],[136,14,136,16],[136,17,136,19],[137,1,137,6],[137,8,137,10],[137,11,137,13],[137,14,137,16],[137,17,137,19],[138,1,138,6],[138,8,138,10],[138,11,138,13],[138,14,138,16],[138,17,138,19],[140,1,140,6],[140,8,140,10],[140,11,140,13],[140,14,140,16],[140,17,140,19],[142,1,142,6],[142,8,142,10],[142,11,142,13],[142,14,142,16],[142,17,142,19],[143,1,143,4],[143,5,143,6],[143,8,143,10],[143,11,143,13],[143,14,143,16],[143,17,143,19],[145,1,145,7],[145,8,145,10],[145,11,145,13],[145,14,145,16],[145,17,145,19],[146,1,146,7],[146,8,146,10],[146,11,146,13],[146,14,146,16],[146,17,146,19],[147,6,147,7],[147,8,147,10],[147,11,147,13],[147,14,147,16],[147,17,147,19]]}
[null,"COMMITTENTE:"]
[null,"OGGETTO DELL'INCARICO:"]
[null,"DANNO:"]
[null,"CALCOLO DEI COMPENSI \nI compensi sono calcolati sulla base del D.M. GIUSTIZIA 20/07/2012, n. 140 \"Regolamento recante la determinazione dei parametri per la liquidazione da parte di un organo giurisdizionale dei compensi per le professioni regolamentate vigilate dal Ministero della giustizia, ai sensi dell’articolo 9 del decreto-legge 24 gennaio 2012 n. 1 convertito con modificazioni dalla legge 24 marzo 2012 n. 27.\"\nCosì come previsto dall'ordinanza 108/2020 del Commisario per la Ricostruzione post- sisma 2016"]
[]
[null,"RIPARTIZIONE DELL'ONORARIO FRA I SOGGETTI PREVISTI DALL'ORD. 108/2020",{"$nulls":37},"IMPOSTAZIONI STANDARD DELLE PRESTAZIONI.\nAll’utilizzatore rimane l’esclusiva responsabilità e il corretto impiego del programma, \nLa consapevole interpretazione ed il necessario controllo dei risultati delle elaborazioni, \npertanto il produttore non potrà per nessun motivo essere ritenuto responsabile per alcun danno, diretto o indiretto, per mancati guadagni od altro in conseguenza dell’utilizzazione delle programma stesso."]
[null,null,"PROFESSIONISTA",{"$nulls":3},"TITOLO NOME E COGNOME",null,"ONORARIO",{"$nulls":5},"SPESE"]
[null,1,"COORDINATORE",{"$nulls":5},{"$f":"X128","v":{"v":0,"d":"0.00 €"}}]
[null,2,"DIRETTORE DEI LAVORI",{"$nulls":5},{"$f":"Y128","v":{"v":0,"d":"0.00 €"}}]
[null,3,"ALTRO PROFESSIONISTA 1",{"$nulls":5},{"$f":"Z128","v":{"v":0,"d":"0.00 €"}}]
[null,4,"ALTRO PROFESSIONISTA 2",{"$nulls":5},{"$f":"AA128","v":{"v":0,"d":"0.00 €"}}]
[null,5,"SICUREZZA PROGETTO",{"$nulls":5},{"$f":"AB128","v":{"v":0,"d":"0.00 €"}}]
[null,6,"SICUREZZA ESECUZIONE",{"$nulls":5},{"$f":"AC128","v":{"v":0,"d":"0.00 €"}}]
[null,7,"COLLAUDATORE",{"$nulls":5},{"$f":"AD128","v":{"v":0,"d":"0.00 €"}}]
[null,8,"GEOLOGO",{"$nulls":5},{"$f":"AE128","v":{"v":0,"d":"0.00 €"}},{"$nulls":35},"NB QUANDO SI VA IN STAMPA IMPOSTARE \"ADATTA TUTTE LE COLONNE SU UNA PAGINA\" "]
[null,null,"TOTALE",{"$nulls":5},{"$f":"SUM(I8:N15)","v":{"v":0,"d":"0.00 €"}},{"$nulls":5},{"$f":"I129","v":{"v":0,"d":"0.00 €"}}]
[]
[null,"in giallo le prestazioni \"standard\", in rosa le \"specialistiche\", in verde \"la sicurezza\" - come previsto da ord. 108/2020"]
[null,"IMPORTI DI RIFERIMENTO A BASE DI CALCOLO:"]
[null,"Editare le celle in azzuro",{"$nulls":6},"Categorie",{"$nulls":14},1,2,3,4,5,6,7,8]
[null,"Modalità di compilazione:\n- Inserire il valore delle opere per ciascuna categoria\n- Scegliere la destinazione funzionale delle opere\n- Inserire il grado di complessità \n- Digitare \"X\" nell'apposita colonna per attivare tutte le prestazioni\n- Inserire il progettista nella casella di fianco alla singola prestazione (numero d'ordine 1,2 ...)",{"$nulls":6},"Edilizia",null,null,"Strutture",null,null,"Impianti  \nTermo-Idraulico",null,null,"Impianto \nElettrico",{"$nulls":5},"COORDINATORE","DIRETTORE DEI LAVORI","SPECIALISTA 1","SPECIALISTA 2","SICUREZZA PROGETTO","SICUREZZA ESECUZIONE","COLLAUDATORE","GEOLOGO"]
[null,"Valore opera",{"$nulls":3},"V",{"$f":"CONCATENATE(\"Importo complessivo opere: \n€ \",TEXT(SUM(I22:T22),\"### ##0.00\"))","v":"Importo complessivo opere: \n€  000"}]
[null,"Parametro",{"$nulls":3},"P",null,null,{"$f":"IF(I22<>0,0.03+10/POWER(I22,0.4),\"0\")","v":"0"},null,null,{"$f":"IF(L22<>0,0.03+10/POWER(L22,0.4),\"0\")","v":"0"},null,null,{"$f":"IF(O22<>0,0.03+10/POWER(O22,0.4),\"0\")","v":"0"},null,null,{"$f":"IF(R22<>0,0.03+10/POWER(R22,0.4),\"0\")","v":"0"}]
[null,"Destinazione funzionale delle opere",{"$nulls":18},"IMPOSTAZIONI \nSTANDARD",null,null,"COORDINATORE","DIRETTORE DEI LAVORI","SPECIALISTA 1","SPECIALISTA 2","SICUREZZA PROGETTO","SICUREZZA ESECUZIONE","COLLAUDATORE","GEOLOGO",{"$nulls":3},"---"]
[null,"Complessità",{"$nulls":3},"G","Grado di complessità (min-medio-max)",null,{"$f":"IF(I24<>\"\",VLOOKUP(I24,'Tabella-Z1'!$B$4:$F$11,5),\"\")","v":""},null,null,{"$f":"IF(L24<>\"\",VLOOKUP(L24,'Tabella-Z1'!$B$12:$F$14,5),\"\")","v":""},null,null,{"$f":"IF(O24<>\"\",VLOOKUP(O24,'Tabella-Z1'!$B$15:$F$20,5),\"\")","v":""},null,null,{"$f":"IF(R24<>\"\",VLOOKUP(R24,'Tabella-Z1'!$B$15:$F$20,5),\"\")","v":""},{"$nulls":16},"1. DEMOLIZIONE E RICOSTRUZIONE"]
[{"$nulls":34},"2. MIGLIORAMENTO/ADEGUAMENTO SISMICO"]
[{"$nulls":34},"3. MIGLIORAMENTO EDIFICIO VINCOLATO"]
[null,"nella casella azzurra indicare il professionista (numero da 1 a 8) autore della prestazione",{"$nulls":21},1,2,3,4,5,6,7,8,{"$nulls":3},"4. DANNI LIEVI - L0",{"$nulls":3},5]
[null,"PROGETTAZIONE PRELIMINARE",{"$nulls":21},"PROGETTAZIONE PRELIMINARE",{"$nulls":10},1,2,3,4,1]
[null,"PROGETTAZIONE","b.I)\nPROGETTAZIONE PRELIMINARE","prestazioni affidate","incidenza Q","QbI.01\nQpf.01","Relazioni, planimetrie, elaborati grafici (art.17, comma1, lettere a), b), e), d.P.R. 207/10)  ","X",null,{"$f":"IF($H30=\"x\",IF(AND(I30>0,I30<9),K30,0),0)","v":{"v":0,"d":"0.000"}},{"v":0.09,"d":"0.090"},null,{"$f":"IF($H30=\"x\",IF(AND(L30>0,L30<9),N30,0),0)","v":{"v":0,"d":"0.000"}},{"v":0.09,"d":"0.090"},null,{"$f":"IF($H30=\"x\",IF(AND(O30>0,O30<9),Q30,0),0)","v":{"v":0,"d":"0.000"}},{"v":0.09,"d":"0.090"},null,{"$f":"IF($H30=\"x\",IF(AND(R30>0,R30<9),T30,0),0)","v":{"v":0,"d":"0.000"}},{"v":0.09,"d":"0.090"},{"$nulls":3},{"$f":"IF(H30=\"X\",IF(I30=$X$20,ROUND(I$23*I$22*I$26*K30,2),0)+IF(L30=$X$20,ROUND(L$23*L$22*L$26*N30,2),0)+IF(O30=$X$20,ROUND(O$23*O$22*O$26*Q30,2),0)+IF(R30=$X$20,ROUND(R$23*R$22*R$26*T30,2),0),0)","v":{"v":0,"d":"0.00 €"}},{"$f":"IF(H30=\"X\",IF(I30=$Y$20,ROUND(I$23*I$22*I$26*K30,2),0)+IF(L30=$Y$20,ROUND(L$23*L$22*L$26*N30,2),0)+IF(O30=$Y$20,ROUND(O$23*O$22*O$26*Q30,2),0)+IF(R30=$Y$20,ROUND(R$23*R$22*R$26*T30,2),0),0)","v":{"v":0,"d":"0.00 €"}},{"$f":"IF(H30=\"X\",IF(I30=$Z$20,ROUND(I$23*I$22*I$26*K30,2),0)+IF(L30=$Z$20,ROUND(L$23*L$22*L$26*N30,2),0)+IF(O30=$Z$20,ROUND(O$23*O$22*O$26*Q30,2),0)+IF(R30=$Z$20,ROUND(R$23*R$22*R$26*T30,2),0),0)","v":{"v":0,"d":"0.00 €"}},{"$f":"IF(H30=\"X\",IF(I30=$AA$20,ROUND(I$23*I$22*I$26*K30,2),0)+IF(L30=$AA$20,ROUND(L$23*L$22*L$26*N30,2),0)+IF(O30=$AA$20,ROUND(O$23*O$22*O$26*Q30,2),0)+IF(R30=$AA$20,ROUND(R$23*R$22*R$26*T30,2),0),0)","v":{"v":0,"d":"0.00 €"}},{"$f":"IF(H30=\"X\",IF(I30=$AB$20,ROUND(I$23*I$22*I$26*K30,2),0)+IF(L30=$AB$20,ROUND(L$23*L$22*L$26*N30,2),0)+IF(O30=$AB$20,ROUND(O$23*O$22*O$26*Q30,2),0)+IF(R30=$AB$20,ROUND(R$23*R$22*R$26*T30,2),0),0)","v":{"v":0,"d":"0.00 €"}},{"$f":"IF(H30=\"X\",IF(I30=$AC$20,ROUND(I$23*I$22*I$26*K30,2),0)+IF(L30=$AC$20,ROUND(L$23*L$22*L$26*N30,2),0)+IF(O30=$AC$20,ROUND(O$23*O$22*O$26*Q30,2),0)+IF(R30=$AC$20,ROUND(R$23*R$22*R$26*T30,2),0),0)","v":{"v":0,"d":"0.00 €"}},{"$f":"IF(H30=\"X\",IF(I30=$AD$20,ROUND(I$23*I$22*I$26*K30,2),0)+IF(L30=$AD$20,ROUND(L$23*L$22*L$26*N30,2),0)+IF(O30=$AD$20,ROUND(O$23*O$22*O$26*Q30,2),0)+IF(R30=$AD$20,ROUND(R$23*R$22*R$26*T30,2),0),0)","v":{"v":0,"d":"0.00 €"}},{"$f":"IF(H30=\"X\",IF(I30=$AE$20,ROUND(I$23*I$22*I$26*K30,2),0)+IF(L30=$AE$20,ROUND(L$23*L$22*L$26*N30,2),0)+IF(O30=$AE$20,ROUND(O$23*O$22*O$26*Q30,2),0)+IF(R30=$AE$20,ROUND(R$23*R$22*R$26*T30,2),0),0)","v":{"v":0,"d":"0.00 €"}},{"$nulls":3},"X","X","X","X"]
[{"$nulls":5}," QbI.02  ","Calcolo sommario spesa, quadro economico di progetto (art.17, comma 1, lettere g), h), d.P.R. 207/10)  ","X",null,{"$f":"IF($H31=\"x\",IF(AND(I31>0,I31<9),K31,0),0)","v":{"v":0,"d":"0.000"}},{"v":0.01,"d":"0.010"},null,{"v":0,"d":"0.000"},{"v":0.01,"d":"0.010"},null,{"v":0,"d":"0.000"},{"v":0.01,"d":"0.010"},null,{"$f":"IF($H31=\"x\",IF(AND(R31>0,R31<9),T31,0),0)","v":{"v":0,"d":"0.000"}},{"v":0.01,"d":"0.010"},{"$nulls":3},{"v":0,"d":"0.00 €"},{"v":0,"d":"0.00 €"},{"v":0,"d":"0.00 €"},{"v":0,"d":"0.00 €"},{"v":0,"d":"0.00 €"},{"v":0,"d":"0.00 €"},{"v":0,"d":"0.00 €"},{"v":0,"d":"0.00 €"}]
[{"$nulls":5}," QbI.03  ","Piano economico e finanziario di massima (art.17, comma 4, d.P.R. 207/10 \u0081]art.164 D. lgs. 163/06 \u0081]art.1, comma 3, all.XXI)","X",null,{"v":0,"d":"0.000"},{"v":0.03,"d":"0.030"},null,{"v":0,"d":"0.000"},{"v":0.03,"d":"0.030"},null,{"v":0,"d":"0.000"},{"v":0.03,"d":"0.030"},null,{"v":0,"d":"0.000"},{"v":0.03,"d":"0.030"},{"$nulls":3},{"v":0,"d":"0.00 €"},{"v":0,"d":"0.00 €"},{"v":0,"d":"0.00 €"},{"v":0,"d":"0.00 €"},{"v":0,"d":"0.00 €"},{"v":0,"d":"0.00 €"},{"v":0,"d":"0.00 €"},{"v":0,"d":"0.00 €"}]
[{"$nulls":5}," QbI.04  ","Capitolato speciale descrittivo e prestazionale, schema di contratto (art.17, comma 3, lettere b), c), d.P.R. 207/10 \u0081]art.164, d.lgs. 163/06 \u0081]art.7, Allegato XXI)","X",null,{"v":0,"d":"0.000"},{"v":0.07,"d":"0.070"},null,{"v":0,"d":"0.000"},{"v":0.07,"d":"0.070"},null,{"v":0,"d":"0.000"},{"v":0.07,"d":"0.070"},null,{"v":0,"d":"0.000"},{"v":0.07,"d":"0.070"},{"$nulls":3},{"v":0,"d":"0.00 €"},{"v":0,"d":"0.00 €"},{"v":0,"d":"0.00 €"},{"v":0,"d":"0.00 €"},{"v":0,"d":"0.00 €"},{"v":0,"d":"0.00 €"},{"v":0,"d":"0.00 €"},{"v":0,"d":"0.00 €"}]
[{"$nulls":5}," QbI.05\nQps.02.01"," Relazione di indagine geotecnica (art.19, comma 1, d.P.R. 207/10)  ","X",null,{"v":0,"d":"0.000"},{"v":0.03,"d":"0.030"},null,{"v":0,"d":"0.000"},{"v":0.03,"d":"0.030"},null,{"v":0,"d":"0.000"},{"v":0.03,"d":"0.030"},null,{"v":0,"d":"0.000"},{"v":0.03,"d":"0.030"},{"$nulls":3},{"v":0,"d":"0.00 €"},{"v":0,"d":"0.00 €"},{"v":0,"d":"0.00 €"},{"v":0,"d":"0.00 €"},{"v":0,"d":"0.00 €"},{"v":0,"d":"0.00 €"},{"v":0,"d":"0.00 €"},{"v":0,"d":"0.00 €"},{"$nulls":3},"X","X","X"]
[{"$nulls":5}," QbI.06  "," Relazione di indagine idrologica (art.19, comma 1, d.P.R. 207/10)  ","X",null,{"v":0,"d":"0.000"},0.015,null,{"v":0,"d":"0.000"},0.015,null,{"v":0,"d":"0.000"},0.015,null,{"v":0,"d":"0.000"},0.015,{"$nulls":3},{"v":0,"d":"0.00 €"},{"v":0,"d":"0.00 €"},{"v":0,"d":"0.00 €"},{"v":0,"d":"0.00 €"},{"v":0,"d":"0.00 €"},{"v":0,"d":"0.00 €"},{"v":0,"d":"0.00 €"},{"v":0,"d":"0.00 €"}]
[{"$nulls":5}," QbI.07\nQps.04.01"," Relazione di indagine idraulica (art.19, comma 1, d.P.R. 207/10)  ","X",null,{"v":0,"d":"0.000"},0.015,null,{"v":0,"d":"0.000"},0.015,null,{"v":0,"d":"0.000"},0.015,null,{"v":0,"d":"0.000"},0.015,{"$nulls":3},{"v":0,"d":"0.00 €"},{"v":0,"d":"0.00 €"},{"v":0,"d":"0.00 €"},{"v":0,"d":"0.00 €"},{"v":0,"d":"0.00 €"},{"v":0,"d":"0.00 €"},{"v":0,"d":"0.00 €"},{"v":0,"d":"0.00 €"}]
[{"$nulls":5}," QbI.08\nQps.05.01"," Relazione di indagine sismica (art.19, comma 1, d.P.R. 207/10)  ","X",null,{"v":0,"d":"0.000"},0.015,null,{"v":0,"d":"0.000"},0.015,null,{"v":0,"d":"0.000"},0.015,null,{"v":0,"d":"0.000"},0.015,{"$nulls":3},{"v":0,"d":"0.00 €"},{"v":0,"d":"0.00 €"},{"v":0,"d":"0.00 €"},{"v":0,"d":"0.00 €"},{"v":0,"d":"0.00 €"},{"v":0,"d":"0.00 €"},{"v":0,"d":"0.00 €"},{"v":0,"d":"0.00 €"},{"$nulls":3},"X","X","X"]
[{"$nulls":5},"QbI.09  \nQps.09"," Relazione di indagine archeologica (art.19, comma 1, d.P.R. 207/10)  ","X",null,{"v":0,"d":"0.000"},0.015,null,{"v":0,"d":"0.000"},0.015,null,{"v":0,"d":"0.000"},0.015,null,{"v":0,"d":"0.000"},0.015,{"$nulls":3},{"v":0,"d":"0.00 €"},{"v":0,"d":"0.00 €"},{"v":0,"d":"0.00 €"},{"v":0,"d":"0.00 €"},{"v":0,"d":"0.00 €"},{"v":0,"d":"0.00 €"},{"v":0,"d":"0.00 €"},{"v":0,"d":"0.00 €"}]
[{"$nulls":5}," QbI.10\nQps.10.01"," Relazione di indagine geologica (art.19, comma 1, d.P.R. 207/10)\n(PROFESSIONISTA 8)","X",null,{"v":0,"d":"0.000"},{"v":0.05,"d":"0.050"},null,{"v":0,"d":"0.000"},{"v":0.05,"d":"0.050"},null,{"v":0,"d":"0.000"},{"v":0.05,"d":"0.050"},null,{"v":0,"d":"0.000"},{"v":0.05,"d":"0.050"},{"$nulls":3},{"v":0,"d":"0.00 €"},{"v":0,"d":"0.00 €"},{"v":0,"d":"0.00 €"},{"v":0,"d":"0.00 €"},{"v":0,"d":"0.00 €"},{"v":0,"d":"0.00 €"},{"v":0,"d":"0.00 €"},{"v":0,"d":"0.00 €"},{"$nulls":3},"X","X","X"]
[{"$nulls":5}," QbI.11  "," Progettazione integrale e coordinata \u0081- Integrazione delle prestazioni specialistiche (art.90, comma 7, d.lgs. 163/06) . Relazione tecno\u0081]alimentare  ","X",null,{"v":0,"d":"0.000"},{"v":0.02,"d":"0.020"},null,{"v":0,"d":"0.000"},{"v":0.02,"d":"0.020"},null,{"v":0,"d":"0.000"},{"v":0.02,"d":"0.020"},null,{"v":0,"d":"0.000"},{"v":0.02,"d":"0.020"},{"$nulls":3},{"v":0,"d":"0.00 €"},{"v":0,"d":"0.00 €"},{"v":0,"d":"0.00 €"},{"v":0,"d":"0.00 €"},{"v":0,"d":"0.00 €"},{"v":0,"d":"0.00 €"},{"v":0,"d":"0.00 €"},{"v":0,"d":"0.00 €"}]
[{"$nulls":5}," QbI.12  "," Studio di inserimento urbanistico (art.164, d.lgs. 163/06 \u0081]art.1, comma 2, lettera l), all.XXI6  ","X",null,{"v":0,"d":"0.000"},{"v":0.03,"d":"0.030"},null,{"v":0,"d":"0.000"},{"v":0.03,"d":"0.030"},null,{"v":0,"d":"0.000"},{"v":0.01,"d":"0.010"},null,{"v":0,"d":"0.000"},{"v":0.01,"d":"0.010"},{"$nulls":3},{"v":0,"d":"0.00 €"},{"v":0,"d":"0.00 €"},{"v":0,"d":"0.00 €"},{"v":0,"d":"0.00 €"},{"v":0,"d":"0.00 €"},{"v":0,"d":"0.00 €"},{"v":0,"d":"0.00 €"},{"v":0,"d":"0.00 €"}]
[{"$nulls":5},"QbI.13\nQps.01","Relazione tecnica sullo stato di consistenza degli   immobili da ristrutturare (art.17, comma 3, lettera a), d.P.R. 207/10) h  ","X",null,{"v":0,"d":"0.000"},{"v":0.03,"d":"0.030"},null,{"v":0,"d":"0.000"},{"v":0.03,"d":"0.030"},null,{"v":0,"d":"0.000"},{"v":0.03,"d":"0.030"},null,{"v":0,"d":"0.000"},{"v":0.03,"d":"0.030"},{"$nulls":3},{"v":0,"d":"0.00 €"},{"v":0,"d":"0.00 €"},{"v":0,"d":"0.00 €"},{"v":0,"d":"0.00 €"},{"v":0,"d":"0.00 €"},{"v":0,"d":"0.00 €"},{"v":0,"d":"0.00 €"},{"v":0,"d":"0.00 €"},{"$nulls":3},"X","X","X","X"]
[{"$nulls":5},"QbI.14\nQps.11.01"," Prime indicazioni di progettazione antincendio (d.m. 6/02/1982)  ","X",null,{"v":0,"d":"0.000"},0.005,null,{"v":0,"d":"0.000"},0.005,null,{"v":0,"d":"0.000"},0.005,null,{"v":0,"d":"0.000"},0.005,{"$nulls":3},{"v":0,"d":"0.00 €"},{"v":0,"d":"0.00 €"},{"v":0,"d":"0.00 €"},{"v":0,"d":"0.00 €"},{"v":0,"d":"0.00 €"},{"v":0,"d":"0.00 €"},{"v":0,"d":"0.00 €"},{"v":0,"d":"0.00 €"}]
[{"$nulls":5},"QbI.15\nQS.01.01"," Prime indicazioni e prescrizioni per la stesura dei Piani di Sicurezza (PROFESSIONISTA 5 - SICUR. PROGETTAZ.)","X",null,{"v":0,"d":"0.000"},{"v":0.01,"d":"0.010"},{"$f":"IF(I44=\"\",\"\",I44)","v":""},{"v":0,"d":"0.000"},{"v":0.01,"d":"0.010"},{"$f":"IF(I44=\"\",\"\",I44)","v":""},{"v":0,"d":"0.000"},{"v":0.01,"d":"0.010"},{"$f":"IF(I44=\"\",\"\",I44)","v":""},{"v":0,"d":"0.000"},{"v":0.01,"d":"0.010"},{"$nulls":3},{"v":0,"d":"0.00 €"},{"v":0,"d":"0.00 €"},{"v":0,"d":"0.00 €"},{"v":0,"d":"0.00 €"},{"v":0,"d":"0.00 €"},{"v":0,"d":"0.00 €"},{"v":0,"d":"0.00 €"},{"v":0,"d":"0.00 €"},{"$nulls":3},"X","X","X","X"]
[{"$nulls":5}," QbI.16  "," Studi di prefattibilita ambientale/Sicurezza alimentare  ","X",null,{"v":0,"d":"0.000"},{"v":0.06,"d":"0.060"},null,{"v":0,"d":"0.000"},{"v":0.06,"d":"0.060"},null,{"v":0,"d":"0.000"},{"v":0.06,"d":"0.060"},null,{"v":0,"d":"0.000"},{"v":0.06,"d":"0.060"},{"$nulls":3},{"v":0,"d":"0.00 €"},{"v":0,"d":"0.00 €"},{"v":0,"d":"0.00 €"},{"v":0,"d":"0.00 €"},{"v":0,"d":"0.00 €"},{"v":0,"d":"0.00 €"},{"v":0,"d":"0.00 €"},{"v":0,"d":"0.00 €"}]
[null,"totale incidenze",{"$nulls":3},"∑ Q i",{"$nulls":3},{"$f":"SUM(J30:J45)","v":{"v":0,"d":"0.000"}},{"$f":"J46","v":{"v":0,"d":"0.000"}},null,{"$f":"SUM(M30:M45)","v":{"v":0,"d":"0.000"}},{"$f":"M46","v":{"v":0,"d":"0.000"}},null,{"$f":"SUM(P30:P45)","v":{"v":0,"d":"0.000"}},{"$f":"P46","v":{"v":0,"d":"0.000"}},null,{"$f":"SUM(S30:S45)","v":{"v":0,"d":"0.000"}},{"$f":"S46","v":{"v":0,"d":"0.000"}},{"$nulls":12},{"$f":"I48-SUM(X30:AE45)","v":{"v":0,"d":"0.00 €"}}]
[null,"Compenso al netto di spese ed oneri CNPAIA",{"$nulls":3},"V*P*G*ΣQ",null,null,{"$f":"K46*I26*I23*I22","v":{"v":0,"d":"0.00 €"}},null,null,{"$f":"N46*L26*L23*L22","v":{"v":0,"d":"0.00 €"}},null,null,{"$f":"Q46*O26*O23*O22","v":{"v":0,"d":"0.00 €"}},null,null,{"$f":"T46*R26*R23*R22","v":{"v":0,"d":"0.00 €"}},{"$nulls":3},"eventuale aggiustamento\ndx-sx",null,{"$f":"AG46","v":{"v":0,"d":"0.00 €"}}]
[null,"COMPENSO AL NETTO DELLE SPESE",{"$nulls":6},{"$f":"ROUND(SUM(I47:T47),2)","v":{"v":0,"d":"0.00 €"}},{"$nulls":12},{"$f":"IF(I48=SUM(X48:AE48),\"OK\",\"CONTROLLA\")","v":"OK"},{"$f":"SUM(X48:AE48)-I48","v":{"v":0,"d":"0.00 €"}},{"$f":"SUM(X30:X47)","v":{"v":0,"d":"0.00 €"}},{"v":0,"d":"0.00 €"},{"v":0,"d":"0.00 €"},{"v":0,"d":"0.00 €"},{"v":0,"d":"0.00 €"},{"v":0,"d":"0.00 €"},{"v":0,"d":"0.00 €"},{"v":0,"d":"0.00 €"}]
[]
[null,"PROGETTAZIONE DEFINITIVA",{"$nulls":21},"PROGETTAZIONE DEFINITIVA"]
[null,"PROGETTAZIONE","b.II)\nPROGETTAZIONE DEFINITIVA","prestazioni affidate","incidenza Q"," QbII.01  "," Relazioni generale e tecniche, Elaborati grafici art.24, comma 2, lettere a), b), d), f), d.P.R. 207/10)  ","X",null,{"$f":"IF($H51=\"x\",IF(AND(I51>0,I51<9),K51,0),0)","v":{"v":0,"d":"0.000"}},{"v":0.23,"d":"0.230"},null,{"$f":"IF($H51=\"x\",IF(AND(L51>0,L51<9),N51,0),0)","v":{"v":0,"d":"0.000"}},{"v":0.18,"d":"0.180"},null,{"$f":"IF($H51=\"x\",IF(AND(O51>0,O51<9),Q51,0),0)","v":{"v":0,"d":"0.000"}},{"v":0.2,"d":"0.200"},null,{"$f":"IF($H51=\"x\",IF(AND(R51>0,R51<9),T51,0),0)","v":{"v":0,"d":"0.000"}},{"v":0.2,"d":"0.200"},{"$nulls":3},{"$f":"IF(H51=\"X\",IF(I51=$X$20,ROUND(I$23*I$22*I$26*K51,2),0)+IF(L51=$X$20,ROUND(L$23*L$22*L$26*N51,2),0)+IF(O51=$X$20,ROUND(O$23*O$22*O$26*Q51,2),0)+IF(R51=$X$20,ROUND(R$23*R$22*R$26*T51,2),0),0)","v":{"v":0,"d":"0.00 €"}},{"$f":"IF(H51=\"X\",IF(I51=$Y$20,ROUND(I$23*I$22*I$26*K51,2),0)+IF(L51=$Y$20,ROUND(L$23*L$22*L$26*N51,2),0)+IF(O51=$Y$20,ROUND(O$23*O$22*O$26*Q51,2),0)+IF(R51=$Y$20,ROUND(R$23*R$22*R$26*T51,2),0),0)","v":{"v":0,"d":"0.00 €"}},{"$f":"IF(H51=\"X\",IF(I51=$Z$20,ROUND(I$23*I$22*I$26*K51,2),0)+IF(L51=$Z$20,ROUND(L$23*L$22*L$26*N51,2),0)+IF(O51=$Z$20,ROUND(O$23*O$22*O$26*Q51,2),0)+IF(R51=$Z$20,ROUND(R$23*R$22*R$26*T51,2),0),0)","v":{"v":0,"d":"0.00 €"}},{"$f":"IF(H51=\"X\",IF(I51=$AA$20,ROUND(I$23*I$22*I$26*K51,2),0)+IF(L51=$AA$20,ROUND(L$23*L$22*L$26*N51,2),0)+IF(O51=$AA$20,ROUND(O$23*O$22*O$26*Q51,2),0)+IF(R51=$AA$20,ROUND(R$23*R$22*R$26*T51,2),0),0)","v":{"v":0,"d":"0.00 €"}},{"$f":"IF(H51=\"X\",IF(I51=$AB$20,ROUND(I$23*I$22*I$26*K51,2),0)+IF(L51=$AB$20,ROUND(L$23*L$22*L$26*N51,2),0)+IF(O51=$AB$20,ROUND(O$23*O$22*O$26*Q51,2),0)+IF(R51=$AB$20,ROUND(R$23*R$22*R$26*T51,2),0),0)","v":{"v":0,"d":"0.00 €"}},{"$f":"IF(H51=\"X\",IF(I51=$AC$20,ROUND(I$23*I$22*I$26*K51,2),0)+IF(L51=$AC$20,ROUND(L$23*L$22*L$26*N51,2),0)+IF(O51=$AC$20,ROUND(O$23*O$22*O$26*Q51,2),0)+IF(R51=$AC$20,ROUND(R$23*R$22*R$26*T51,2),0),0)","v":{"v":0,"d":"0.00 €"}},{"$f":"IF(H51=\"X\",IF(I51=$AD$20,ROUND(I$23*I$22*I$26*K51,2),0)+IF(L51=$AD$20,ROUND(L$23*L$22*L$26*N51,2),0)+IF(O51=$AD$20,ROUND(O$23*O$22*O$26*Q51,2),0)+IF(R51=$AD$20,ROUND(R$23*R$22*R$26*T51,2),0),0)","v":{"v":0,"d":"0.00 €"}},{"$f":"IF(H51=\"X\",IF(I51=$AE$20,ROUND(I$23*I$22*I$26*K51,2),0)+IF(L51=$AE$20,ROUND(L$23*L$22*L$26*N51,2),0)+IF(O51=$AE$20,ROUND(O$23*O$22*O$26*Q51,2),0)+IF(R51=$AE$20,ROUND(R$23*R$22*R$26*T51,2),0),0)","v":{"v":0,"d":"0.00 €"}}]
[{"$nulls":5},"QbII.02 \nQpe.04.01"," Disciplinare descrittivo e prestazionale (art.24, comma 2, lettera g), d.P.R. 207/10)  ","X",null,{"v":0,"d":"0.000"},{"v":0.01,"d":"0.010"},null,{"v":0,"d":"0.000"},{"v":0.01,"d":"0.010"},null,{"v":0,"d":"0.000"},{"v":0.01,"d":"0.010"},null,{"v":0,"d":"0.000"},{"v":0.01,"d":"0.010"},{"$nulls":3},{"v":0,"d":"0.00 €"},{"v":0,"d":"0.00 €"},{"v":0,"d":"0.00 €"},{"v":0,"d":"0.00 €"},{"v":0,"d":"0.00 €"},{"v":0,"d":"0.00 €"},{"v":0,"d":"0.00 €"},{"v":0,"d":"0.00 €"},{"$nulls":3},"X","X","X","X"]
[{"$nulls":5},"QbII.03\nQpa.02"," Elenco prezzi, Computo metrico estimativo, Quadro economico (art.24, comma 2, lettere l), m), o), d.P.R. 207/10)  ","X",null,{"v":0,"d":"0.000"},{"v":0.07,"d":"0.070"},null,{"v":0,"d":"0.000"},{"v":0.04,"d":"0.040"},null,{"v":0,"d":"0.000"},{"v":0.07,"d":"0.070"},null,{"v":0,"d":"0.000"},{"v":0.07,"d":"0.070"},{"$nulls":3},{"v":0,"d":"0.00 €"},{"v":0,"d":"0.00 €"},{"v":0,"d":"0.00 €"},{"v":0,"d":"0.00 €"},{"v":0,"d":"0.00 €"},{"v":0,"d":"0.00 €"},{"v":0,"d":"0.00 €"},{"v":0,"d":"0.00 €"},{"$nulls":3},"X","X","X","X"]
[{"$nulls":5},"QbII.04\nQps.12"," Studio di inserimento urbanistico (art.24, comma 2, lettera c), d.P.R. 207/2010)  ","X",null,{"v":0,"d":"0.000"},{"v":0.03,"d":"0.030"},null,{"v":0,"d":"0.000"},{"v":0.03,"d":"0.030"},null,{"v":0,"d":"0.000"},{"v":0.01,"d":"0.010"},null,{"v":0,"d":"0.000"},{"v":0.01,"d":"0.010"},{"$nulls":3},{"v":0,"d":"0.00 €"},{"v":0,"d":"0.00 €"},{"v":0,"d":"0.00 €"},{"v":0,"d":"0.00 €"},{"v":0,"d":"0.00 €"},{"v":0,"d":"0.00 €"},{"v":0,"d":"0.00 €"},{"v":0,"d":"0.00 €"}]
[{"$nulls":5}," QbII.05  "," Schema di contratto, Capitolato speciale d'appalto h  ","X",null,{"v":0,"d":"0.000"},{"v":0.07,"d":"0.070"},null,{"v":0,"d":"0.000"},{"v":0.07,"d":"0.070"},null,{"v":0,"d":"0.000"},{"v":0.08,"d":"0.080"},null,{"v":0,"d":"0.000"},{"v":0.08,"d":"0.080"},{"$nulls":3},{"v":0,"d":"0.00 €"},{"v":0,"d":"0.00 €"},{"v":0,"d":"0.00 €"},{"v":0,"d":"0.00 €"},{"v":0,"d":"0.00 €"},{"v":0,"d":"0.00 €"},{"v":0,"d":"0.00 €"},{"v":0,"d":"0.00 €"}]
[{"$nulls":5},"QbII.06\nQps.02.02"," Relazione di indagine geotecnica (art.26, comma 1, d.P.R. 207/2010)  ","X",null,{"v":0,"d":"0.000"},{"v":0.09,"d":"0.090"},null,{"v":0,"d":"0.000"},{"v":0.09,"d":"0.090"},null,{"v":0,"d":"0.000"},{"v":0.09,"d":"0.090"},null,{"v":0,"d":"0.000"},{"v":0.09,"d":"0.090"},{"$nulls":3},{"v":0,"d":"0.00 €"},{"v":0,"d":"0.00 €"},{"v":0,"d":"0.00 €"},{"v":0,"d":"0.00 €"},{"v":0,"d":"0.00 €"},{"v":0,"d":"0.00 €"},{"v":0,"d":"0.00 €"},{"v":0,"d":"0.00 €"},{"$nulls":3},"X","X","X"]
[{"$nulls":5}," QbII.07  "," Relazione di indagine idrologica (art.26, comma 1, d.P.R. 207/2010)  ","X",null,{"v":0,"d":"0.000"},{"v":0.03,"d":"0.030"},null,{"v":0,"d":"0.000"},{"v":0.03,"d":"0.030"},null,{"v":0,"d":"0.000"},{"v":0.03,"d":"0.030"},null,{"v":0,"d":"0.000"},{"v":0.03,"d":"0.030"},{"$nulls":3},{"v":0,"d":"0.00 €"},{"v":0,"d":"0.00 €"},{"v":0,"d":"0.00 €"},{"v":0,"d":"0.00 €"},{"v":0,"d":"0.00 €"},{"v":0,"d":"0.00 €"},{"v":0,"d":"0.00 €"},{"v":0,"d":"0.00 €"}]
[{"$nulls":5},"QbII.08\nQps.04.02"," Relazione di indagine idraulica (art.26, comma 1, d.P.R. 207/2010)  ",{"$f":"IF(H36<>\"\",H36,\"\")","v":"X"},{"$f":"IF(I36=\"\",\"\",I36)","v":""},{"v":0,"d":"0.000"},{"v":0.03,"d":"0.030"},{"$f":"IF(L36=\"\",\"\",L36)","v":""},{"v":0,"d":"0.000"},{"v":0.03,"d":"0.030"},{"$f":"IF(O36=\"\",\"\",O36)","v":""},{"v":0,"d":"0.000"},{"v":0.03,"d":"0.030"},{"$f":"IF(R36=\"\",\"\",R36)","v":""},{"v":0,"d":"0.000"},{"v":0.03,"d":"0.030"},{"$nulls":3},{"v":0,"d":"0.00 €"},{"v":0,"d":"0.00 €"},{"v":0,"d":"0.00 €"},{"v":0,"d":"0.00 €"},{"v":0,"d":"0.00 €"},{"v":0,"d":"0.00 €"},{"v":0,"d":"0.00 €"},{"v":0,"d":"0.00 €"}]
[{"$nulls":5},"QbII.09\nQps.05.02"," Relazione di indagine sismica (art.19, comma 1, d.P.R. 207/10)  ","X",null,{"v":0,"d":"0.000"},{"v":0.03,"d":"0.030"},null,{"v":0,"d":"0.000"},{"v":0.03,"d":"0.030"},null,{"v":0,"d":"0.000"},{"v":0.03,"d":"0.030"},null,{"v":0,"d":"0.000"},{"v":0.03,"d":"0.030"},{"$nulls":3},{"v":0,"d":"0.00 €"},{"v":0,"d":"0.00 €"},{"v":0,"d":"0.00 €"},{"v":0,"d":"0.00 €"},{"v":0,"d":"0.00 €"},{"v":0,"d":"0.00 €"},{"v":0,"d":"0.00 €"},{"v":0,"d":"0.00 €"},{"$nulls":3},"X","X","X"]
[{"$nulls":5},"QbII.10\nQps.10.02"," Relazione di indagine geologica (art.26, comma 1, d.P.R. 207/2010)\n(PROFESSIONISTA 8)",{"$f":"IF(H39<>\"\",H39,\"\")","v":"X"},{"$f":"IF(I39=\"\",\"\",I39)","v":""},{"v":0,"d":"0.000"},{"v":0.15,"d":"0.150"},{"$f":"IF(L39=\"\",\"\",L39)","v":""},{"v":0,"d":"0.000"},{"v":0.15,"d":"0.150"},{"$f":"IF(O39=\"\",\"\",O39)","v":""},{"v":0,"d":"0.000"},{"v":0.15,"d":"0.150"},{"$f":"IF(R39=\"\",\"\",R39)","v":""},{"v":0,"d":"0.000"},{"v":0.15,"d":"0.150"},{"$nulls":3},{"v":0,"d":"0.00 €"},{"v":0,"d":"0.00 €"},{"v":0,"d":"0.00 €"},{"v":0,"d":"0.00 €"},{"v":0,"d":"0.00 €"},{"v":0,"d":"0.00 €"},{"v":0,"d":"0.00 €"},{"v":0,"d":"0.00 €"}]
[{"$nulls":5},"QbII.11\nQps.06"," Analisi storico critica e relazione sulle strutture esistenti (art.26, d.P.R. 207/10 \u0081-cap.8,5, d.m. 14/01/2008)  ","X","  ",{"$nulls":3},{"v":0,"d":"0.000"},{"v":0.09,"d":"0.090"},"  ",null,null,"  ",{"$nulls":5},{"v":0,"d":"0.00 €"},{"v":0,"d":"0.00 €"},{"v":0,"d":"0.00 €"},{"v":0,"d":"0.00 €"},{"v":0,"d":"0.00 €"},{"v":0,"d":"0.00 €"},{"v":0,"d":"0.00 €"},{"v":0,"d":"0.00 €"},{"$nulls":4},"X","X","X"]
[{"$nulls":5},"QbII.12\nQps.07"," Relazione sulle indagini dei materiali e delle strutture per edifici esistenti (art.26, d.P.R. 207)  ","X","  ",{"$nulls":3},{"v":0,"d":"0.000"},{"v":0.12,"d":"0.120"},"  ",null,null,"  ",{"$nulls":5},{"v":0,"d":"0.00 €"},{"v":0,"d":"0.00 €"},{"v":0,"d":"0.00 €"},{"v":0,"d":"0.00 €"},{"v":0,"d":"0.00 €"},{"v":0,"d":"0.00 €"},{"v":0,"d":"0.00 €"},{"v":0,"d":"0.00 €"},{"$nulls":4},"X","X","X"]
[{"$nulls":5},"QbII.13\nQps.08"," Verifica sismica delle strutture esistenti e individuazione delle carenza strutturali (art.26, d.P.R. \u0081- cap.8,5, d.m. 14/01/2008)  ","X","  ",{"$nulls":3},{"v":0,"d":"0.000"},{"v":0.18,"d":"0.180"},"  ",null,null,"  ",{"$nulls":5},{"v":0,"d":"0.00 €"},{"v":0,"d":"0.00 €"},{"v":0,"d":"0.00 €"},{"v":0,"d":"0.00 €"},{"v":0,"d":"0.00 €"},{"v":0,"d":"0.00 €"},{"v":0,"d":"0.00 €"},{"v":0,"d":"0.00 €"},{"$nulls":4},"X","X","X"]
[{"$nulls":5}," QbII.14  "," Progettazione integrale e coordinata \u0081- Integrazione delle prestazioni specialistiche (art.90, comma 7, d.lgs. 163/2006)  ","X",null,{"$f":"IF($H64=\"x\",IF(AND(I64>0,I64<9),K64,0),0)","v":{"v":0,"d":"0.000"}},{"v":0.05,"d":"0.050"},null,{"v":0,"d":"0.000"},{"v":0.05,"d":"0.050"},null,{"$f":"IF($H64=\"x\",IF(AND(O64>0,O64<9),Q64,0),0)","v":{"v":0,"d":"0.000"}},{"v":0.05,"d":"0.050"},null,{"$f":"IF($H64=\"x\",IF(AND(R64>0,R64<9),T64,0),0)","v":{"v":0,"d":"0.000"}},{"v":0.05,"d":"0.050"},{"$nulls":3},{"v":0,"d":"0.00 €"},{"v":0,"d":"0.00 €"},{"v":0,"d":"0.00 €"},{"v":0,"d":"0.00 €"},{"v":0,"d":"0.00 €"},{"v":0,"d":"0.00 €"},{"v":0,"d":"0.00 €"},{"v":0,"d":"0.00 €"}]
[{"$nulls":5},"QbII.15\nQps.11.02"," Elaborati di progettazione antincendio (d.m. 16/02/1982)  ","X",null,{"v":0,"d":"0.000"},{"v":0.06,"d":"0.060"},null,{"v":0,"d":"0.000"},{"v":0.06,"d":"0.060"},null,{"v":0,"d":"0.000"},{"v":0.06,"d":"0.060"},null,{"v":0,"d":"0.000"},{"v":0.06,"d":"0.060"},{"$nulls":3},{"v":0,"d":"0.00 €"},{"v":0,"d":"0.00 €"},{"v":0,"d":"0.00 €"},{"v":0,"d":"0.00 €"},{"v":0,"d":"0.00 €"},{"v":0,"d":"0.00 €"},{"v":0,"d":"0.00 €"},{"v":0,"d":"0.00 €"}]
[{"$nulls":5},"QbII.16\nQps.13"," Relazione paesaggistica (d.lgs. 42/2004)  ","X",null,{"v":0,"d":"0.000"},{"v":0.02,"d":"0.020"},null,{"v":0,"d":"0.000"},{"v":0.02,"d":"0.020"},null,{"v":0,"d":"0.000"},{"v":0.02,"d":"0.020"},null,{"v":0,"d":"0.000"},{"v":0.02,"d":"0.020"},{"$nulls":3},{"v":0,"d":"0.00 €"},{"v":0,"d":"0.00 €"},{"v":0,"d":"0.00 €"},{"v":0,"d":"0.00 €"},{"v":0,"d":"0.00 €"},{"v":0,"d":"0.00 €"},{"v":0,"d":"0.00 €"},{"v":0,"d":"0.00 €"}]
[{"$nulls":5},"QbII.17\nQps.14"," Elaborati e relazioni per requisiti acustici (Legge 447/95\u0081]d.p.c.m. 512/97)  ","X",null,{"v":0,"d":"0.000"},{"v":0.02,"d":"0.020"},null,{"v":0,"d":"0.000"},{"v":0.02,"d":"0.020"},null,{"v":0,"d":"0.000"},{"v":0.02,"d":"0.020"},null,{"v":0,"d":"0.000"},{"v":0.02,"d":"0.020"},{"$nulls":3},{"v":0,"d":"0.00 €"},{"v":0,"d":"0.00 €"},{"v":0,"d":"0.00 €"},{"v":0,"d":"0.00 €"},{"v":0,"d":"0.00 €"},{"v":0,"d":"0.00 €"},{"v":0,"d":"0.00 €"},{"v":0,"d":"0.00 €"},{"$nulls":3},"X"]
[{"$nulls":5},"QbII.18\nQps.15"," Relazione di qualificazione energetica (art.8, d.lgs. 311/2006)  ","X",null,{"v":0,"d":"0.000"},{"v":0.03,"d":"0.030"},null,{"v":0,"d":"0.000"},{"v":0.03,"d":"0.030"},null,{"v":0,"d":"0.000"},{"v":0.03,"d":"0.030"},null,{"v":0,"d":"0.000"},{"v":0.03,"d":"0.030"},{"$nulls":3},{"v":0,"d":"0.00 €"},{"v":0,"d":"0.00 €"},{"v":0,"d":"0.00 €"},{"v":0,"d":"0.00 €"},{"v":0,"d":"0.00 €"},{"v":0,"d":"0.00 €"},{"v":0,"d":"0.00 €"},{"v":0,"d":"0.00 €"},{"$nulls":3},"X"]
[{"$nulls":5},"QbII.19\nQps.16"," Diagnosi e qualificazione energetica degli edifici esistenti (d.P.R. 59), esclusi i rilievi e le indagini  ","X",null,{"v":0,"d":"0.000"},{"v":0.02,"d":"0.020"},null,{"v":0,"d":"0.000"},{"v":0.02,"d":"0.020"},null,{"v":0,"d":"0.000"},{"v":0.02,"d":"0.020"},null,{"v":0,"d":"0.000"},{"v":0.02,"d":"0.020"},{"$nulls":3},{"v":0,"d":"0.00 €"},{"v":0,"d":"0.00 €"},{"v":0,"d":"0.00 €"},{"v":0,"d":"0.00 €"},{"v":0,"d":"0.00 €"},{"v":0,"d":"0.00 €"},{"v":0,"d":"0.00 €"},{"v":0,"d":"0.00 €"},{"$nulls":4},"X"]
[{"$nulls":5},"QbII.20\nQS.01.02"," Aggiornamento delle prime indicazioni e prescrizioni per la redazione del PSC  (PROFESSIONISTA 5 - SICUR. PROGETTAZ.)",{"$f":"IF(H44<>\"\",H44,\"\")","v":"X"},{"$f":"IF(I44=\"\",\"\",I44)","v":""},{"v":0,"d":"0.000"},{"v":0.01,"d":"0.010"},{"$f":"I70","v":""},{"v":0,"d":"0.000"},{"v":0.01,"d":"0.010"},{"$f":"I70","v":""},{"v":0,"d":"0.000"},{"v":0.01,"d":"0.010"},{"$f":"I70","v":""},{"v":0,"d":"0.000"},{"v":0.01,"d":"0.010"},{"$nulls":3},{"v":0,"d":"0.00 €"},{"v":0,"d":"0.00 €"},{"v":0,"d":"0.00 €"},{"v":0,"d":"0.00 €"},{"v":0,"d":"0.00 €"},{"v":0,"d":"0.00 €"},{"v":0,"d":"0.00 €"},{"v":0,"d":"0.00 €"}]
[{"$nulls":5}," QbII.21  "," Studio di impatto ambientale o di fattibilita ambientale (VIA\u0081]VAS\u0081]AIA) . Indagini alimentari ed analisi predittive di sicurezza alimentare  ","X",null,{"v":0,"d":"0.000"},{"v":0.15,"d":"0.150"},null,{"v":0,"d":"0.000"},{"v":0.12,"d":"0.120"},null,{"$f":"IF($H71=\"x\",IF(AND(O71>0,O71<9),Q71,0),0)","v":{"v":0,"d":"0.000"}},{"v":0.19,"d":"0.190"},null,{"v":0,"d":"0.000"},{"v":0.19,"d":"0.190"},{"$nulls":3},{"v":0,"d":"0.00 €"},{"v":0,"d":"0.00 €"},{"v":0,"d":"0.00 €"},{"v":0,"d":"0.00 €"},{"v":0,"d":"0.00 €"},{"v":0,"d":"0.00 €"},{"v":0,"d":"0.00 €"},{"v":0,"d":"0.00 €"}]
[null,"totale incidenze",{"$nulls":3},"∑ Q i",{"$nulls":3},{"$f":"SUM(J51:J71)","v":{"v":0,"d":"0.000"}},{"$f":"J72","v":{"v":0,"d":"0.000"}},null,{"$f":"SUM(M51:M71)","v":{"v":0,"d":"0.000"}},{"$f":"M72","v":{"v":0,"d":"0.000"}},null,{"$f":"SUM(P51:P71)","v":{"v":0,"d":"0.000"}},{"$f":"P72","v":{"v":0,"d":"0.000"}},null,{"$f":"SUM(S51:S71)","v":{"v":0,"d":"0.000"}},{"$f":"S72","v":{"v":0,"d":"0.000"}},{"$nulls":12},{"$f":"I74-SUM(X51:AE71)","v":{"v":0,"d":"0.00 €"}}]
[null,"Compenso al netto di spese ed oneri CNPAIA ",{"$nulls":3},"V*P*G*ΣQ",null,null,{"$f":"K72*I22*I23*I26","v":{"v":0,"d":"0.00 €"}},null,null,{"$f":"N72*L22*L23*L26","v":{"v":0,"d":"0.00 €"}},null,null,{"$f":"Q72*O22*O23*O26","v":{"v":0,"d":"0.00 €"}},null,null,{"$f":"T72*R22*R23*R26","v":{"v":0,"d":"0.00 €"}},{"$nulls":3},"eventuale aggiustamento\ndx-sx",null,{"$f":"AG72","v":{"v":0,"d":"0.00 €"}}]
[null,"COMPENSO AL NETTO DELLE SPESE",{"$nulls":6},{"$f":"ROUND(SUM(I73:T73),2)","v":{"v":0,"d":"0.00 €"}},{"$nulls":12},{"$f":"IF(I74=SUM(X74:AE74),\"OK\",\"CONTROLLA\")","v":"OK"},{"$f":"SUM(X74:AE74)-I74","v":{"v":0,"d":"0.00 €"}},{"$f":"SUM(X51:X73)","v":{"v":0,"d":"0.00 €"}},{"$f":"SUM(Y51:Y73)","v":{"v":0,"d":"0.00 €"}},{"$f":"SUM(Z51:Z73)","v":{"v":0,"d":"0.00 €"}},{"$f":"SUM(AA51:AA73)","v":{"v":0,"d":"0.00 €"}},{"v":0,"d":"0.00 €"},{"v":0,"d":"0.00 €"},{"v":0,"d":"0.00 €"},{"v":0,"d":"0.00 €"}]
[]
[null,"PROGETTAZIONE ESECUTIVA",{"$nulls":21},"PROGETTAZIONE ESECUTIVA"]
[null,"PROGETTAZIONE"," b.III) PROGETTAZIONE ESECUTIVA  ","prestazioni affidate","incidenza Q","QbIII.01\nQpe.01"," Relazione generale e specialistiche, Elaborati grafici, Calcoli esecutivi (art.33, comma 1, lettere a), b), c), d), d.P.R. 207/10)","X",null,{"$f":"IF($H77=\"x\",IF(AND(I77>0,I77<9),K77,0),0)","v":{"v":0,"d":"0.000"}},{"v":0.1,"d":"0.100"},null,{"$f":"IF($H77=\"x\",IF(AND(L77>0,L77<9),N77,0),0)","v":{"v":0,"d":"0.000"}},{"v":0.12,"d":"0.120"},null,{"$f":"IF($H77=\"x\",IF(AND(O77>0,O77<9),Q77,0),0)","v":{"v":0,"d":"0.000"}},{"v":0.15,"d":"0.150"},null,{"$f":"IF($H77=\"x\",IF(AND(R77>0,R77<9),T77,0),0)","v":{"v":0,"d":"0.000"}},{"v":0.15,"d":"0.150"},{"$nulls":3},{"$f":"IF(H77=\"X\",IF(I77=$X$20,ROUND(I$23*I$22*I$26*K77,2),0)+IF(L77=$X$20,ROUND(L$23*L$22*L$26*N77,2),0)+IF(O77=$X$20,ROUND(O$23*O$22*O$26*Q77,2),0)+IF(R77=$X$20,ROUND(R$23*R$22*R$26*T77,2),0),0)","v":{"v":0,"d":"0.00 €"}},{"$f":"IF(H77=\"X\",IF(I77=$Y$20,ROUND(I$23*I$22*I$26*K77,2),0)+IF(L77=$Y$20,ROUND(L$23*L$22*L$26*N77,2),0)+IF(O77=$Y$20,ROUND(O$23*O$22*O$26*Q77,2),0)+IF(R77=$Y$20,ROUND(R$23*R$22*R$26*T77,2),0),0)","v":{"v":0,"d":"0.00 €"}},{"$f":"IF(H77=\"X\",IF(I77=$Z$20,ROUND(I$23*I$22*I$26*K77,2),0)+IF(L77=$Z$20,ROUND(L$23*L$22*L$26*N77,2),0)+IF(O77=$Z$20,ROUND(O$23*O$22*O$26*Q77,2),0)+IF(R77=$Z$20,ROUND(R$23*R$22*R$26*T77,2),0),0)","v":{"v":0,"d":"0.00 €"}},{"$f":"IF(H77=\"X\",IF(I77=$AA$20,ROUND(I$23*I$22*I$26*K77,2),0)+IF(L77=$AA$20,ROUND(L$23*L$22*L$26*N77,2),0)+IF(O77=$AA$20,ROUND(O$23*O$22*O$26*Q77,2),0)+IF(R77=$AA$20,ROUND(R$23*R$22*R$26*T77,2),0),0)","v":{"v":0,"d":"0.00 €"}},{"$f":"IF(H77=\"X\",IF(I77=$AB$20,ROUND(I$23*I$22*I$26*K77,2),0)+IF(L77=$AB$20,ROUND(L$23*L$22*L$26*N77,2),0)+IF(O77=$AB$20,ROUND(O$23*O$22*O$26*Q77,2),0)+IF(R77=$AB$20,ROUND(R$23*R$22*R$26*T77,2),0),0)","v":{"v":0,"d":"0.00 €"}},{"$f":"IF(H77=\"X\",IF(I77=$AC$20,ROUND(I$23*I$22*I$26*K77,2),0)+IF(L77=$AC$20,ROUND(L$23*L$22*L$26*N77,2),0)+IF(O77=$AC$20,ROUND(O$23*O$22*O$26*Q77,2),0)+IF(R77=$AC$20,ROUND(R$23*R$22*R$26*T77,2),0),0)","v":{"v":0,"d":"0.00 €"}},{"$f":"IF(H77=\"X\",IF(I77=$AD$20,ROUND(I$23*I$22*I$26*K77,2),0)+IF(L77=$AD$20,ROUND(L$23*L$22*L$26*N77,2),0)+IF(O77=$AD$20,ROUND(O$23*O$22*O$26*Q77,2),0)+IF(R77=$AD$20,ROUND(R$23*R$22*R$26*T77,2),0),0)","v":{"v":0,"d":"0.00 €"}},{"$f":"IF(H77=\"X\",IF(I77=$AE$20,ROUND(I$23*I$22*I$26*K77,2),0)+IF(L77=$AE$20,ROUND(L$23*L$22*L$26*N77,2),0)+IF(O77=$AE$20,ROUND(O$23*O$22*O$26*Q77,2),0)+IF(R77=$AE$20,ROUND(R$23*R$22*R$26*T77,2),0),0)","v":{"v":0,"d":"0.00 €"}},{"$nulls":3},"X","X","X","X"]
[{"$nulls":5},"QbIII.02\nQpe.02"," Particolari costruttivi e decorativi (art.36, comma 1, lettera c), d.P.R. 207/10)  ","X",null,{"v":0,"d":"0.000"},{"v":0.13,"d":"0.130"},null,{"v":0,"d":"0.000"},{"v":0.13,"d":"0.130"},null,{"$f":"IF($H78=\"x\",IF(AND(O78>0,O78<9),Q78,0),0)","v":{"v":0,"d":"0.000"}},{"v":0.05,"d":"0.050"},null,{"v":0,"d":"0.000"},{"v":0.05,"d":"0.050"},{"$nulls":3},{"v":0,"d":"0.00 €"},{"v":0,"d":"0.00 €"},{"v":0,"d":"0.00 €"},{"v":0,"d":"0.00 €"},{"v":0,"d":"0.00 €"},{"v":0,"d":"0.00 €"},{"v":0,"d":"0.00 €"},{"v":0,"d":"0.00 €"},{"$nulls":3},"X","X","X","X"]
[{"$nulls":5},"QbIII.03\nQpe.03"," Computo metrico estimativo, Quadro economico, Elenco prezzi e eventuale analisi, Quadro dell'incidenza percentuale della quantita di manodopera (art.33, comma 1, lettere f), g), i), d.P.R. 207/10)  ","X",null,{"v":0,"d":"0.000"},{"v":0.04,"d":"0.040"},null,{"v":0,"d":"0.000"},{"v":0.03,"d":"0.030"},null,{"v":0,"d":"0.000"},{"v":0.05,"d":"0.050"},null,{"v":0,"d":"0.000"},{"v":0.05,"d":"0.050"},{"$nulls":3},{"v":0,"d":"0.00 €"},{"v":0,"d":"0.00 €"},{"v":0,"d":"0.00 €"},{"v":0,"d":"0.00 €"},{"v":0,"d":"0.00 €"},{"v":0,"d":"0.00 €"},{"v":0,"d":"0.00 €"},{"v":0,"d":"0.00 €"},{"$nulls":3},"X","X","X","X"]
[{"$nulls":5},"QbIII.04\nQpe.04.02"," Schema di contratto, capitolato speciale d'appalto, cronoprogramma (art.33, comma 1, lettere l), h), d.P.R. 207/10)  ","X",null,{"v":0,"d":"0.000"},{"v":0.02,"d":"0.020"},null,{"v":0,"d":"0.000"},{"v":0.01,"d":"0.010"},null,{"v":0,"d":"0.000"},{"v":0.02,"d":"0.020"},null,{"v":0,"d":"0.000"},{"v":0.02,"d":"0.020"},{"$nulls":3},{"v":0,"d":"0.00 €"},{"v":0,"d":"0.00 €"},{"v":0,"d":"0.00 €"},{"v":0,"d":"0.00 €"},{"v":0,"d":"0.00 €"},{"v":0,"d":"0.00 €"},{"v":0,"d":"0.00 €"},{"v":0,"d":"0.00 €"},{"$nulls":3},"X","X","X","X"]
[{"$nulls":5},"QbIII.05\nQpe.05"," Piano di manutenzione dell'opera (art.33, comma 1, lettera e) d.P.R. 207/10)  ","X",null,{"v":0,"d":"0.000"},{"v":0.02,"d":"0.020"},null,{"v":0,"d":"0.000"},0.025,null,{"v":0,"d":"0.000"},{"v":0.03,"d":"0.030"},null,{"v":0,"d":"0.000"},{"v":0.03,"d":"0.030"},{"$nulls":3},{"v":0,"d":"0.00 €"},{"v":0,"d":"0.00 €"},{"v":0,"d":"0.00 €"},{"v":0,"d":"0.00 €"},{"v":0,"d":"0.00 €"},{"v":0,"d":"0.00 €"},{"v":0,"d":"0.00 €"},{"v":0,"d":"0.00 €"},{"$nulls":3},"X","X","X","X"]
[{"$nulls":5},"QbIII.06\nQpe.06"," Progettazione integrale e coordinata, Integrazione delle prestazioni specialistiche (art.90, comma 7, d.lgs. 163/2006)\n(PROFESSIONISTA 1 - COORDINATORE)","X",null,{"v":0,"d":"0.000"},{"v":0.05,"d":"0.050"},{"$f":"IF(I82=\"\",\"\",I82)","v":""},{"v":0,"d":"0.000"},{"v":0.05,"d":"0.050"},{"$f":"IF(I82=\"\",\"\",I82)","v":""},{"v":0,"d":"0.000"},{"v":0.05,"d":"0.050"},{"$f":"IF(I82=\"\",\"\",I82)","v":""},{"v":0,"d":"0.000"},{"v":0.05,"d":"0.050"},{"$nulls":3},{"v":0,"d":"0.00 €"},{"v":0,"d":"0.00 €"},{"v":0,"d":"0.00 €"},{"v":0,"d":"0.00 €"},{"v":0,"d":"0.00 €"},{"v":0,"d":"0.00 €"},{"v":0,"d":"0.00 €"},{"v":0,"d":"0.00 €"},{"$nulls":3},"X","X","X","X"]
[{"$nulls":5},"QbIII.07\nQS.01.03","Piano di Sicurezza e Coordinamento. \n(PROFESSIONISTA 5 - SICUR. PROGETTAZ.)",{"$f":"IF(H44<>\"\",H44,\"\")","v":"X"},{"$f":"IF(I70=\"\",\"\",I70)","v":""},{"v":0,"d":"0.000"},{"v":0.1,"d":"0.100"},{"$f":"IF(I83=\"\",\"\",I83)","v":""},{"v":0,"d":"0.000"},{"v":0.1,"d":"0.100"},{"$f":"IF(I83=\"\",\"\",I83)","v":""},{"v":0,"d":"0.000"},{"v":0.1,"d":"0.100"},{"$f":"IF(I83=\"\",\"\",I83)","v":""},{"v":0,"d":"0.000"},{"v":0.1,"d":"0.100"},{"$nulls":3},{"v":0,"d":"0.00 €"},{"v":0,"d":"0.00 €"},{"v":0,"d":"0.00 €"},{"v":0,"d":"0.00 €"},{"v":0,"d":"0.00 €"},{"v":0,"d":"0.00 €"},{"v":0,"d":"0.00 €"},{"v":0,"d":"0.00 €"}]
[null,"totale incidenze",{"$nulls":3},"∑ Q i",{"$nulls":3},{"$f":"SUM(J77:J83)","v":{"v":0,"d":"0.000"}},{"$f":"J84","v":{"v":0,"d":"0.000"}},null,{"$f":"SUM(M77:M83)","v":{"v":0,"d":"0.000"}},{"$f":"M84","v":{"v":0,"d":"0.000"}},null,{"$f":"SUM(P77:P83)","v":{"v":0,"d":"0.000"}},{"$f":"P84","v":{"v":0,"d":"0.000"}},null,{"$f":"SUM(S77:S83)","v":{"v":0,"d":"0.000"}},{"$f":"S84","v":{"v":0,"d":"0.000"}},{"$nulls":12},{"$f":"I86-SUM(X77:AE83)","v":{"v":0,"d":"0.00 €"}}]
[null,"Compenso al netto di spese ed oneri CNPAIA",{"$nulls":3},"V*P*G*ΣQ",null,null,{"$f":"K84*I22*I23*I26","v":{"v":0,"d":"0.00 €"}},null,null,{"$f":"N84*L22*L23*L26","v":{"v":0,"d":"0.00 €"}},null,null,{"$f":"Q84*O22*O23*O26","v":{"v":0,"d":"0.00 €"}},null,null,{"$f":"T84*R22*R23*R26","v":{"v":0,"d":"0.00 €"}},{"$nulls":3},"eventuale aggiustamento\ndx-sx",null,{"$f":"AG84","v":{"v":0,"d":"0.00 €"}}]
[null,"COMPENSO AL NETTO DELLE SPESE",{"$nulls":6},{"$f":"ROUND(SUM(I85:T85),2)","v":{"v":0,"d":"0.00 €"}},{"$nulls":12},{"$f":"IF(I86=SUM(X86:AE86),\"OK\",\"CONTROLLA\")","v":"OK"},{"$f":"SUM(X86:AE86)-I86","v":{"v":0,"d":"0.00 €"}},{"$f":"SUM(X77:X85)","v":{"v":0,"d":"0.00 €"}},{"v":0,"d":"0.00 €"},{"v":0,"d":"0.00 €"},{"v":0,"d":"0.00 €"},{"v":0,"d":"0.00 €"},{"v":0,"d":"0.00 €"},{"v":0,"d":"0.00 €"},{"v":0,"d":"0.00 €"}]
[]
[null,"ESECUZIONE DEI LAVORI",{"$nulls":21},"ESECUZIONE DEI LAVORI"]
[null,"DIREZIONE ESECUTIVA"," C.I)ESECUZIONE DEI LAVORI  ","prestazioni affidate","incidenza Q","QcI.01\nQe.01"," Direzione lavori, assistenza al collaudo, prove d'officina (art.148, d.P.R. 207/10)8  ","X",null,{"$f":"IF($H89=\"x\",IF(AND(I89>0,I89<9),K89,0),0)","v":{"v":0,"d":"0.000"}},{"v":0.32,"d":"0.320"},null,{"$f":"IF($H89=\"x\",IF(AND(L89>0,L89<9),N89,0),0)","v":{"v":0,"d":"0.000"}},{"v":0.38,"d":"0.380"},null,{"$f":"IF($H89=\"x\",IF(AND(O89>0,O89<9),Q89,0),0)","v":{"v":0,"d":"0.000"}},{"v":0.32,"d":"0.320"},null,{"$f":"IF($H89=\"x\",IF(AND(R89>0,R89<9),T89,0),0)","v":{"v":0,"d":"0.000"}},{"v":0.32,"d":"0.320"},{"$nulls":3},{"$f":"IF(H89=\"X\",IF(I89=$X$20,ROUND(I$23*I$22*I$26*K89,2),0)+IF(L89=$X$20,ROUND(L$23*L$22*L$26*N89,2),0)+IF(O89=$X$20,ROUND(O$23*O$22*O$26*Q89,2),0)+IF(R89=$X$20,ROUND(R$23*R$22*R$26*T89,2),0),0)","v":{"v":0,"d":"0.00 €"}},{"$f":"IF(H89=\"X\",IF(I89=$Y$20,ROUND(I$23*I$22*I$26*K89,2),0)+IF(L89=$Y$20,ROUND(L$23*L$22*L$26*N89,2),0)+IF(O89=$Y$20,ROUND(O$23*O$22*O$26*Q89,2),0)+IF(R89=$Y$20,ROUND(R$23*R$22*R$26*T89,2),0),0)","v":{"v":0,"d":"0.00 €"}},{"$f":"IF(H89=\"X\",IF(I89=$Z$20,ROUND(I$23*I$22*I$26*K89,2),0)+IF(L89=$Z$20,ROUND(L$23*L$22*L$26*N89,2),0)+IF(O89=$Z$20,ROUND(O$23*O$22*O$26*Q89,2),0)+IF(R89=$Z$20,ROUND(R$23*R$22*R$26*T89,2),0),0)","v":{"v":0,"d":"0.00 €"}},{"$f":"IF(H89=\"X\",IF(I89=$AA$20,ROUND(I$23*I$22*I$26*K89,2),0)+IF(L89=$AA$20,ROUND(L$23*L$22*L$26*N89,2),0)+IF(O89=$AA$20,ROUND(O$23*O$22*O$26*Q89,2),0)+IF(R89=$AA$20,ROUND(R$23*R$22*R$26*T89,2),0),0)","v":{"v":0,"d":"0.00 €"}},{"$f":"IF(H89=\"X\",IF(I89=$AB$20,ROUND(I$23*I$22*I$26*K89,2),0)+IF(L89=$AB$20,ROUND(L$23*L$22*L$26*N89,2),0)+IF(O89=$AB$20,ROUND(O$23*O$22*O$26*Q89,2),0)+IF(R89=$AB$20,ROUND(R$23*R$22*R$26*T89,2),0),0)","v":{"v":0,"d":"0.00 €"}},{"$f":"IF(H89=\"X\",IF(I89=$AC$20,ROUND(I$23*I$22*I$26*K89,2),0)+IF(L89=$AC$20,ROUND(L$23*L$22*L$26*N89,2),0)+IF(O89=$AC$20,ROUND(O$23*O$22*O$26*Q89,2),0)+IF(R89=$AC$20,ROUND(R$23*R$22*R$26*T89,2),0),0)","v":{"v":0,"d":"0.00 €"}},{"$f":"IF(H89=\"X\",IF(I89=$AD$20,ROUND(I$23*I$22*I$26*K89,2),0)+IF(L89=$AD$20,ROUND(L$23*L$22*L$26*N89,2),0)+IF(O89=$AD$20,ROUND(O$23*O$22*O$26*Q89,2),0)+IF(R89=$AD$20,ROUND(R$23*R$22*R$26*T89,2),0),0)","v":{"v":0,"d":"0.00 €"}},{"$f":"IF(H89=\"X\",IF(I89=$AE$20,ROUND(I$23*I$22*I$26*K89,2),0)+IF(L89=$AE$20,ROUND(L$23*L$22*L$26*N89,2),0)+IF(O89=$AE$20,ROUND(O$23*O$22*O$26*Q89,2),0)+IF(R89=$AE$20,ROUND(R$23*R$22*R$26*T89,2),0),0)","v":{"v":0,"d":"0.00 €"}},{"$nulls":3},"X","X","X","X"]
[{"$nulls":5},"QcI.02\nQe.02","Liquidazione (art.194, comma 1, d.P.R. 207/10)  ","X",null,{"v":0,"d":"0.000"},{"v":0.03,"d":"0.030"},null,{"v":0,"d":"0.000"},{"v":0.02,"d":"0.020"},null,{"v":0,"d":"0.000"},{"v":0.03,"d":"0.030"},null,{"v":0,"d":"0.000"},{"v":0.03,"d":"0.030"},{"$nulls":3},{"v":0,"d":"0.00 €"},{"v":0,"d":"0.00 €"},{"v":0,"d":"0.00 €"},{"v":0,"d":"0.00 €"},{"v":0,"d":"0.00 €"},{"v":0,"d":"0.00 €"},{"v":0,"d":"0.00 €"},{"v":0,"d":"0.00 €"},{"$nulls":3},"X","X","X","X"]
[{"$nulls":5}," QcI.03  ","Controllo aggiornamento elaborati di progetto, aggiornamento dei manuali d'uso e manutenzione (art.148, comma 4, d.P.R. 207/2010)  ","X",null,{"v":0,"d":"0.000"},{"v":0.02,"d":"0.020"},null,{"v":0,"d":"0.000"},{"v":0.02,"d":"0.020"},null,{"v":0,"d":"0.000"},{"v":0.02,"d":"0.020"},null,{"v":0,"d":"0.000"},{"v":0.02,"d":"0.020"},{"$nulls":3},{"v":0,"d":"0.00 €"},{"v":0,"d":"0.00 €"},{"v":0,"d":"0.00 €"},{"v":0,"d":"0.00 €"},{"v":0,"d":"0.00 €"},{"v":0,"d":"0.00 €"},{"v":0,"d":"0.00 €"},{"v":0,"d":"0.00 €"}]
[{"$nulls":5}," QcI.04  ","Coordinamento e supervisione dell'ufficio di DL (art.148, comma 2, d.lgs. 163/06)  ","X",null,{"v":0,"d":"0.000"},{"v":0.02,"d":"0.020"},null,{"v":0,"d":"0.000"},{"v":0.02,"d":"0.020"},null,{"v":0,"d":"0.000"},{"v":0.02,"d":"0.020"},null,{"v":0,"d":"0.000"},{"v":0.02,"d":"0.020"},{"$nulls":3},{"v":0,"d":"0.00 €"},{"v":0,"d":"0.00 €"},{"v":0,"d":"0.00 €"},{"v":0,"d":"0.00 €"},{"v":0,"d":"0.00 €"},{"v":0,"d":"0.00 €"},{"v":0,"d":"0.00 €"},{"v":0,"d":"0.00 €"}]
[{"$nulls":5}," QcI.05  "," Ufficio della DL, per ogni addetto con qualifica di direttore operativo (art.149, d.lgs. 163/06)  ","X",null,{"v":0,"d":"0.000"},{"v":0.1,"d":"0.100"},null,{"v":0,"d":"0.000"},{"v":0.1,"d":"0.100"},null,{"v":0,"d":"0.000"},{"v":0.1,"d":"0.100"},null,{"v":0,"d":"0.000"},{"v":0.1,"d":"0.100"},{"$nulls":3},{"v":0,"d":"0.00 €"},{"v":0,"d":"0.00 €"},{"v":0,"d":"0.00 €"},{"v":0,"d":"0.00 €"},{"v":0,"d":"0.00 €"},{"v":0,"d":"0.00 €"},{"v":0,"d":"0.00 €"},{"v":0,"d":"0.00 €"}]
[{"$nulls":5}," QcI.06  "," Ufficio della DL, per ogni addetto con qualifica di ispettore di cantiere (art.150, d.lgs. 163/06)  ","X",null,{"v":0,"d":"0.000"},{"v":0.06,"d":"0.060"},null,{"v":0,"d":"0.000"},{"v":0.06,"d":"0.060"},null,{"v":0,"d":"0.000"},{"v":0.06,"d":"0.060"},null,{"v":0,"d":"0.000"},{"v":0.06,"d":"0.060"},{"$nulls":3},{"v":0,"d":"0.00 €"},{"v":0,"d":"0.00 €"},{"v":0,"d":"0.00 €"},{"v":0,"d":"0.00 €"},{"v":0,"d":"0.00 €"},{"v":0,"d":"0.00 €"},{"v":0,"d":"0.00 €"},{"v":0,"d":"0.00 €"}]
[{"$nulls":5}," QcI.07  "," Variante delle quantita del progetto in corso d'opera (art.161, d.P.R. 207/2010)","X",null,{"v":0,"d":"0.000"},{"v":0.14,"d":"0.140"},null,{"v":0,"d":"0.000"},{"v":0.09,"d":"0.090"},null,{"v":0,"d":"0.000"},{"v":0.15,"d":"0.150"},null,{"v":0,"d":"0.000"},{"v":0.15,"d":"0.150"},{"$nulls":3},{"v":0,"d":"0.00 €"},{"v":0,"d":"0.00 €"},{"v":0,"d":"0.00 €"},{"v":0,"d":"0.00 €"},{"v":0,"d":"0.00 €"},{"v":0,"d":"0.00 €"},{"v":0,"d":"0.00 €"},{"v":0,"d":"0.00 €"}]
[{"$nulls":5},"QcI.08\nQe.04"," Variante del progetto in corso d'opera (art.161, d.P.R. 207/2010) 10  ","X",null,{"v":0,"d":"0.000"},{"v":0.41,"d":"0.410"},null,{"v":0,"d":"0.000"},{"v":0.43,"d":"0.430"},null,{"v":0,"d":"0.000"},{"v":0.32,"d":"0.320"},null,{"v":0,"d":"0.000"},{"v":0.32,"d":"0.320"},{"$nulls":3},{"v":0,"d":"0.00 €"},{"v":0,"d":"0.00 €"},{"v":0,"d":"0.00 €"},{"v":0,"d":"0.00 €"},{"v":0,"d":"0.00 €"},{"v":0,"d":"0.00 €"},{"v":0,"d":"0.00 €"},{"v":0,"d":"0.00 €"}]
[{"$nulls":5},"QcI.09\nQe.05"," Contabilita dei lavori a misura (art.185, d.P.R. 207/10)  ","X",null,{"v":0,"d":"0.000"},{"v":0.18,"d":"0.180"},null,{"v":0,"d":"0.000"},{"v":0.18,"d":"0.180"},null,{"v":0,"d":"0.000"},{"v":0.13,"d":"0.130"},null,{"v":0,"d":"0.000"},{"v":0.13,"d":"0.130"},{"$nulls":3},{"v":0,"d":"0.00 €"},{"v":0,"d":"0.00 €"},{"v":0,"d":"0.00 €"},{"v":0,"d":"0.00 €"},{"v":0,"d":"0.00 €"},{"v":0,"d":"0.00 €"},{"v":0,"d":"0.00 €"},{"v":0,"d":"0.00 €"},{"$nulls":3},"X","X","X","X"]
[{"$nulls":5}," QcI.10  ","Contabilita dei lavori a corpo (art.185, d.P.R. 207/10  ","X",null,{"v":0,"d":"0.000"},{"v":0.1,"d":"0.100"},null,{"v":0,"d":"0.000"},{"v":0.1,"d":"0.100"},null,{"v":0,"d":"0.000"},{"v":0.08,"d":"0.080"},null,{"v":0,"d":"0.000"},{"v":0.08,"d":"0.080"},{"$nulls":3},{"v":0,"d":"0.00 €"},{"v":0,"d":"0.00 €"},{"v":0,"d":"0.00 €"},{"v":0,"d":"0.00 €"},{"v":0,"d":"0.00 €"},{"v":0,"d":"0.00 €"},{"v":0,"d":"0.00 €"},{"v":0,"d":"0.00 €"}]
[{"$nulls":5},"QcI.11\nQe.07","Certificato di regolare esecuzione (art.237, d.P.R. 207/2010)  ","X",null,{"v":0,"d":"0.000"},{"v":0.04,"d":"0.040"},null,{"v":0,"d":"0.000"},{"v":0.04,"d":"0.040"},null,{"v":0,"d":"0.000"},{"v":0.04,"d":"0.040"},null,{"v":0,"d":"0.000"},{"v":0.04,"d":"0.040"},{"$nulls":3},{"v":0,"d":"0.00 €"},{"v":0,"d":"0.00 €"},{"v":0,"d":"0.00 €"},{"v":0,"d":"0.00 €"},{"v":0,"d":"0.00 €"},{"v":0,"d":"0.00 €"},{"v":0,"d":"0.00 €"},{"v":0,"d":"0.00 €"},{"$nulls":3},"X","X","X","X"]
[{"$nulls":5},"QcI.12\nQS.02","Coord-. della sicurezza in esecuzione\n(PROFESSIONISTA 6 - SICUR. ESECUZIONE)","X",null,{"v":0,"d":"0.000"},{"v":0.25,"d":"0.250"},{"$f":"IF(I100=\"\",\"\",I100)","v":""},{"v":0,"d":"0.000"},{"v":0.25,"d":"0.250"},{"$f":"IF(I100=\"\",\"\",I100)","v":""},{"v":0,"d":"0.000"},{"v":0.25,"d":"0.250"},{"$f":"IF(I100=\"\",\"\",I100)","v":""},{"v":0,"d":"0.000"},{"v":0.25,"d":"0.250"},{"$nulls":3},{"v":0,"d":"0.00 €"},{"v":0,"d":"0.00 €"},{"v":0,"d":"0.00 €"},{"v":0,"d":"0.00 €"},{"v":0,"d":"0.00 €"},{"v":0,"d":"0.00 €"},{"v":0,"d":"0.00 €"},{"v":0,"d":"0.00 €"},{"$nulls":3},"X","X","X","X"]
[null,"totale incidenze",{"$nulls":3},"∑ Q i",{"$nulls":3},{"$f":"SUM(J89:J100)","v":{"v":0,"d":"0.000"}},{"$f":"J101","v":{"v":0,"d":"0.000"}},null,{"$f":"SUM(M89:M100)","v":{"v":0,"d":"0.000"}},{"$f":"M101","v":{"v":0,"d":"0.000"}},null,{"$f":"SUM(P89:P100)","v":{"v":0,"d":"0.000"}},{"$f":"P101","v":{"v":0,"d":"0.000"}},null,{"$f":"SUM(S89:S100)","v":{"v":0,"d":"0.000"}},{"$f":"S101","v":{"v":0,"d":"0.000"}},{"$nulls":12},{"$f":"I103-SUM(X89:AE100)","v":{"v":0,"d":"0.00 €"}}]
[null,"Compenso al netto di spese ed oneri CNPAIA ",{"$nulls":3},"V*P*G*ΣQ",null,null,{"$f":"K101*I22*I23*I26","v":{"v":0,"d":"0.00 €"}},null,null,{"$f":"N101*L22*L23*L26","v":{"v":0,"d":"0.00 €"}},null,null,{"$f":"Q101*O22*O23*O26","v":{"v":0,"d":"0.00 €"}},null,null,{"$f":"T101*R22*R23*R26","v":{"v":0,"d":"0.00 €"}},{"$nulls":3},"eventuale aggiustamento\ndx-sx",null,{"$f":"AG101","v":{"v":0,"d":"0.00 €"}}]
[null,"COMPENSO AL NETTO DELLE SPESE",{"$nulls":6},{"$f":"ROUND(SUM(I102:T102),2)","v":{"v":0,"d":"0.00 €"}},{"$nulls":12},{"$f":"IF(I103=SUM(X103:AE103),\"OK\",\"CONTROLLA\")","v":"OK"},{"$f":"SUM(X103:AE103)-I103","v":{"v":0,"d":"0.00 €"}},{"$f":"SUM(X89:X102)","v":{"v":0,"d":"0.00 €"}},{"v":0,"d":"0.00 €"},{"v":0,"d":"0.00 €"},{"v":0,"d":"0.00 €"},{"v":0,"d":"0.00 €"},{"v":0,"d":"0.00 €"},{"v":0,"d":"0.00 €"},{"v":0,"d":"0.00 €"}]
[]
[null,"VERIFICHE E COLLAUDI",{"$nulls":21},"VERIFICHE E COLLAUDI"]
[null," Verifiche e Collaudi "," d.I)VERIFICHE E COLLAUDI  ","prestazioni affidate","incidenza Q"," QdI.01  "," Collaudo tecnico amministrativo (Parte II, Titolo X, d.P.R. 207/10) 11  ","X",null,{"$f":"IF($H106=\"x\",IF(AND(I106>0,I106<9),K106,0),0)","v":{"v":0,"d":"0.000"}},{"v":0.08,"d":"0.080"},null,{"$f":"IF($H106=\"x\",IF(AND(L106>0,L106<9),N106,0),0)","v":{"v":0,"d":"0.000"}},{"v":0.08,"d":"0.080"},null,{"$f":"IF($H106=\"x\",IF(AND(O106>0,O106<9),Q106,0),0)","v":{"v":0,"d":"0.000"}},{"v":0.08,"d":"0.080"},{"$nulls":6},{"$f":"IF(H106=\"X\",IF(I106=$X$20,ROUND(I$23*I$22*I$26*K106,2),0)+IF(L106=$X$20,ROUND(L$23*L$22*L$26*N106,2),0)+IF(O106=$X$20,ROUND(O$23*O$22*O$26*Q106,2),0)+IF(R106=$X$20,ROUND(R$23*R$22*R$26*T106,2),0),0)","v":{"v":0,"d":"0.00 €"}},{"$f":"IF(H106=\"X\",IF(I106=$Y$20,ROUND(I$23*I$22*I$26*K106,2),0)+IF(L106=$Y$20,ROUND(L$23*L$22*L$26*N106,2),0)+IF(O106=$Y$20,ROUND(O$23*O$22*O$26*Q106,2),0)+IF(R106=$Y$20,ROUND(R$23*R$22*R$26*T106,2),0),0)","v":{"v":0,"d":"0.00 €"}},{"$f":"IF(H106=\"X\",IF(I106=$Z$20,ROUND(I$23*I$22*I$26*K106,2),0)+IF(L106=$Z$20,ROUND(L$23*L$22*L$26*N106,2),0)+IF(O106=$Z$20,ROUND(O$23*O$22*O$26*Q106,2),0)+IF(R106=$Z$20,ROUND(R$23*R$22*R$26*T106,2),0),0)","v":{"v":0,"d":"0.00 €"}},{"$f":"IF(H106=\"X\",IF(I106=$AA$20,ROUND(I$23*I$22*I$26*K106,2),0)+IF(L106=$AA$20,ROUND(L$23*L$22*L$26*N106,2),0)+IF(O106=$AA$20,ROUND(O$23*O$22*O$26*Q106,2),0)+IF(R106=$AA$20,ROUND(R$23*R$22*R$26*T106,2),0),0)","v":{"v":0,"d":"0.00 €"}},{"$f":"IF(H106=\"X\",IF(I106=$AB$20,ROUND(I$23*I$22*I$26*K106,2),0)+IF(L106=$AB$20,ROUND(L$23*L$22*L$26*N106,2),0)+IF(O106=$AB$20,ROUND(O$23*O$22*O$26*Q106,2),0)+IF(R106=$AB$20,ROUND(R$23*R$22*R$26*T106,2),0),0)","v":{"v":0,"d":"0.00 €"}},{"$f":"IF(H106=\"X\",IF(I106=$AC$20,ROUND(I$23*I$22*I$26*K106,2),0)+IF(L106=$AC$20,ROUND(L$23*L$22*L$26*N106,2),0)+IF(O106=$AC$20,ROUND(O$23*O$22*O$26*Q106,2),0)+IF(R106=$AC$20,ROUND(R$23*R$22*R$26*T106,2),0),0)","v":{"v":0,"d":"0.00 €"}},{"$f":"IF(H106=\"X\",IF(I106=$AD$20,ROUND(I$23*I$22*I$26*K106,2),0)+IF(L106=$AD$20,ROUND(L$23*L$22*L$26*N106,2),0)+IF(O106=$AD$20,ROUND(O$23*O$22*O$26*Q106,2),0)+IF(R106=$AD$20,ROUND(R$23*R$22*R$26*T106,2),0),0)","v":{"v":0,"d":"0.00 €"}},{"$f":"IF(H106=\"X\",IF(I106=$AE$20,ROUND(I$23*I$22*I$26*K106,2),0)+IF(L106=$AE$20,ROUND(L$23*L$22*L$26*N106,2),0)+IF(O106=$AE$20,ROUND(O$23*O$22*O$26*Q106,2),0)+IF(R106=$AE$20,ROUND(R$23*R$22*R$26*T106,2),0),0)","v":{"v":0,"d":"0.00 €"}}]
[{"$nulls":5}," QdI.02  "," Revisione tecnico contabile (Parte II, Titolo X, d.P.R. 207/10)  ","X",null,{"v":0,"d":"0.000"},{"v":0.02,"d":"0.020"},null,{"v":0,"d":"0.000"},{"v":0.02,"d":"0.020"},null,{"v":0,"d":"0.000"},{"v":0.02,"d":"0.020"},{"$nulls":6},{"$f":"IF(H107=\"X\",IF(I107=$X$20,ROUND(I$23*I$22*I$26*K107,2),0)+IF(L107=$X$20,ROUND(L$23*L$22*L$26*N107,2),0)+IF(O107=$X$20,ROUND(O$23*O$22*O$26*Q107,2),0)+IF(R107=$X$20,ROUND(R$23*R$22*R$26*T107,2),0),0)","v":{"v":0,"d":"0.00 €"}},{"$f":"IF(H107=\"X\",IF(I107=$Y$20,ROUND(I$23*I$22*I$26*K107,2),0)+IF(L107=$Y$20,ROUND(L$23*L$22*L$26*N107,2),0)+IF(O107=$Y$20,ROUND(O$23*O$22*O$26*Q107,2),0)+IF(R107=$Y$20,ROUND(R$23*R$22*R$26*T107,2),0),0)","v":{"v":0,"d":"0.00 €"}},{"$f":"IF(H107=\"X\",IF(I107=$Z$20,ROUND(I$23*I$22*I$26*K107,2),0)+IF(L107=$Z$20,ROUND(L$23*L$22*L$26*N107,2),0)+IF(O107=$Z$20,ROUND(O$23*O$22*O$26*Q107,2),0)+IF(R107=$Z$20,ROUND(R$23*R$22*R$26*T107,2),0),0)","v":{"v":0,"d":"0.00 €"}},{"$f":"IF(H107=\"X\",IF(I107=$AA$20,ROUND(I$23*I$22*I$26*K107,2),0)+IF(L107=$AA$20,ROUND(L$23*L$22*L$26*N107,2),0)+IF(O107=$AA$20,ROUND(O$23*O$22*O$26*Q107,2),0)+IF(R107=$AA$20,ROUND(R$23*R$22*R$26*T107,2),0),0)","v":{"v":0,"d":"0.00 €"}},{"$f":"IF(H107=\"X\",IF(I107=$AB$20,ROUND(I$23*I$22*I$26*K107,2),0)+IF(L107=$AB$20,ROUND(L$23*L$22*L$26*N107,2),0)+IF(O107=$AB$20,ROUND(O$23*O$22*O$26*Q107,2),0)+IF(R107=$AB$20,ROUND(R$23*R$22*R$26*T107,2),0),0)","v":{"v":0,"d":"0.00 €"}},{"$f":"IF(H107=\"X\",IF(I107=$AC$20,ROUND(I$23*I$22*I$26*K107,2),0)+IF(L107=$AC$20,ROUND(L$23*L$22*L$26*N107,2),0)+IF(O107=$AC$20,ROUND(O$23*O$22*O$26*Q107,2),0)+IF(R107=$AC$20,ROUND(R$23*R$22*R$26*T107,2),0),0)","v":{"v":0,"d":"0.00 €"}},{"$f":"IF(H107=\"X\",IF(I107=$AD$20,ROUND(I$23*I$22*I$26*K107,2),0)+IF(L107=$AD$20,ROUND(L$23*L$22*L$26*N107,2),0)+IF(O107=$AD$20,ROUND(O$23*O$22*O$26*Q107,2),0)+IF(R107=$AD$20,ROUND(R$23*R$22*R$26*T107,2),0),0)","v":{"v":0,"d":"0.00 €"}},{"$f":"IF(H107=\"X\",IF(I107=$AE$20,ROUND(I$23*I$22*I$26*K107,2),0)+IF(L107=$AE$20,ROUND(L$23*L$22*L$26*N107,2),0)+IF(O107=$AE$20,ROUND(O$23*O$22*O$26*Q107,2),0)+IF(R107=$AE$20,ROUND(R$23*R$22*R$26*T107,2),0),0)","v":{"v":0,"d":"0.00 €"}}]
[{"$nulls":5},"QdI.04\nQc.04","Collaudo statico (Cap. 9, d.m. 14/01/2008)  \n(PROFESSIONISTA 7 - COLLAUDATORE)","X",{"$nulls":4},{"v":0,"d":"0.000"},{"v":0.22,"d":"0.220"},{"$nulls":9},{"$f":"IF(H108=\"X\",IF(I108=$X$20,ROUND(I$23*I$22*I$26*K108,2),0)+IF(L108=$X$20,ROUND(L$23*L$22*L$26*N108,2),0)+IF(O108=$X$20,ROUND(O$23*O$22*O$26*Q108,2),0)+IF(R108=$X$20,ROUND(R$23*R$22*R$26*T108,2),0),0)","v":{"v":0,"d":"0.00 €"}},{"$f":"IF(H108=\"X\",IF(I108=$Y$20,ROUND(I$23*I$22*I$26*K108,2),0)+IF(L108=$Y$20,ROUND(L$23*L$22*L$26*N108,2),0)+IF(O108=$Y$20,ROUND(O$23*O$22*O$26*Q108,2),0)+IF(R108=$Y$20,ROUND(R$23*R$22*R$26*T108,2),0),0)","v":{"v":0,"d":"0.00 €"}},{"$f":"IF(H108=\"X\",IF(I108=$Z$20,ROUND(I$23*I$22*I$26*K108,2),0)+IF(L108=$Z$20,ROUND(L$23*L$22*L$26*N108,2),0)+IF(O108=$Z$20,ROUND(O$23*O$22*O$26*Q108,2),0)+IF(R108=$Z$20,ROUND(R$23*R$22*R$26*T108,2),0),0)","v":{"v":0,"d":"0.00 €"}},{"$f":"IF(H108=\"X\",IF(I108=$AA$20,ROUND(I$23*I$22*I$26*K108,2),0)+IF(L108=$AA$20,ROUND(L$23*L$22*L$26*N108,2),0)+IF(O108=$AA$20,ROUND(O$23*O$22*O$26*Q108,2),0)+IF(R108=$AA$20,ROUND(R$23*R$22*R$26*T108,2),0),0)","v":{"v":0,"d":"0.00 €"}},{"$f":"IF(H108=\"X\",IF(I108=$AB$20,ROUND(I$23*I$22*I$26*K108,2),0)+IF(L108=$AB$20,ROUND(L$23*L$22*L$26*N108,2),0)+IF(O108=$AB$20,ROUND(O$23*O$22*O$26*Q108,2),0)+IF(R108=$AB$20,ROUND(R$23*R$22*R$26*T108,2),0),0)","v":{"v":0,"d":"0.00 €"}},{"$f":"IF(H108=\"X\",IF(I108=$AC$20,ROUND(I$23*I$22*I$26*K108,2),0)+IF(L108=$AC$20,ROUND(L$23*L$22*L$26*N108,2),0)+IF(O108=$AC$20,ROUND(O$23*O$22*O$26*Q108,2),0)+IF(R108=$AC$20,ROUND(R$23*R$22*R$26*T108,2),0),0)","v":{"v":0,"d":"0.00 €"}},{"$f":"IF(H108=\"X\",IF(I108=$AD$20,ROUND(I$23*I$22*I$26*K108,2),0)+IF(L108=$AD$20,ROUND(L$23*L$22*L$26*N108,2),0)+IF(O108=$AD$20,ROUND(O$23*O$22*O$26*Q108,2),0)+IF(R108=$AD$20,ROUND(R$23*R$22*R$26*T108,2),0),0)","v":{"v":0,"d":"0.00 €"}},{"$f":"IF(H108=\"X\",IF(I108=$AE$20,ROUND(I$23*I$22*I$26*K108,2),0)+IF(L108=$AE$20,ROUND(L$23*L$22*L$26*N108,2),0)+IF(O108=$AE$20,ROUND(O$23*O$22*O$26*Q108,2),0)+IF(R108=$AE$20,ROUND(R$23*R$22*R$26*T108,2),0),0)","v":{"v":0,"d":"0.00 €"}},{"$nulls":3},"X","X","X"]
[{"$nulls":5},"QdI.05\nQc.05"," Collaudo tecnico funzionale degli impianti (d.m. 22/01/2008 n°37)  ","X",{"$nulls":7},{"$f":"IF($H109=\"x\",IF(AND(O109>0,O109<9),Q109,0),0)","v":{"v":0,"d":"0.000"}},{"v":0.18,"d":"0.180"},{"$nulls":6},{"$f":"IF(H109=\"X\",IF(I109=$X$20,ROUND(I$23*I$22*I$26*K109,2),0)+IF(L109=$X$20,ROUND(L$23*L$22*L$26*N109,2),0)+IF(O109=$X$20,ROUND(O$23*O$22*O$26*Q109,2),0)+IF(R109=$X$20,ROUND(R$23*R$22*R$26*T109,2),0),0)","v":{"v":0,"d":"0.00 €"}},{"$f":"IF(H109=\"X\",IF(I109=$Y$20,ROUND(I$23*I$22*I$26*K109,2),0)+IF(L109=$Y$20,ROUND(L$23*L$22*L$26*N109,2),0)+IF(O109=$Y$20,ROUND(O$23*O$22*O$26*Q109,2),0)+IF(R109=$Y$20,ROUND(R$23*R$22*R$26*T109,2),0),0)","v":{"v":0,"d":"0.00 €"}},{"$f":"IF(H109=\"X\",IF(I109=$Z$20,ROUND(I$23*I$22*I$26*K109,2),0)+IF(L109=$Z$20,ROUND(L$23*L$22*L$26*N109,2),0)+IF(O109=$Z$20,ROUND(O$23*O$22*O$26*Q109,2),0)+IF(R109=$Z$20,ROUND(R$23*R$22*R$26*T109,2),0),0)","v":{"v":0,"d":"0.00 €"}},{"$f":"IF(H109=\"X\",IF(I109=$AA$20,ROUND(I$23*I$22*I$26*K109,2),0)+IF(L109=$AA$20,ROUND(L$23*L$22*L$26*N109,2),0)+IF(O109=$AA$20,ROUND(O$23*O$22*O$26*Q109,2),0)+IF(R109=$AA$20,ROUND(R$23*R$22*R$26*T109,2),0),0)","v":{"v":0,"d":"0.00 €"}},{"$f":"IF(H109=\"X\",IF(I109=$AB$20,ROUND(I$23*I$22*I$26*K109,2),0)+IF(L109=$AB$20,ROUND(L$23*L$22*L$26*N109,2),0)+IF(O109=$AB$20,ROUND(O$23*O$22*O$26*Q109,2),0)+IF(R109=$AB$20,ROUND(R$23*R$22*R$26*T109,2),0),0)","v":{"v":0,"d":"0.00 €"}},{"$f":"IF(H109=\"X\",IF(I109=$AC$20,ROUND(I$23*I$22*I$26*K109,2),0)+IF(L109=$AC$20,ROUND(L$23*L$22*L$26*N109,2),0)+IF(O109=$AC$20,ROUND(O$23*O$22*O$26*Q109,2),0)+IF(R109=$AC$20,ROUND(R$23*R$22*R$26*T109,2),0),0)","v":{"v":0,"d":"0.00 €"}},{"$f":"IF(H109=\"X\",IF(I109=$AD$20,ROUND(I$23*I$22*I$26*K109,2),0)+IF(L109=$AD$20,ROUND(L$23*L$22*L$26*N109,2),0)+IF(O109=$AD$20,ROUND(O$23*O$22*O$26*Q109,2),0)+IF(R109=$AD$20,ROUND(R$23*R$22*R$26*T109,2),0),0)","v":{"v":0,"d":"0.00 €"}},{"$f":"IF(H109=\"X\",IF(I109=$AE$20,ROUND(I$23*I$22*I$26*K109,2),0)+IF(L109=$AE$20,ROUND(L$23*L$22*L$26*N109,2),0)+IF(O109=$AE$20,ROUND(O$23*O$22*O$26*Q109,2),0)+IF(R109=$AE$20,ROUND(R$23*R$22*R$26*T109,2),0),0)","v":{"v":0,"d":"0.00 €"}}]
[{"$nulls":5},"QdI.06\nQc.06"," Attestato di certificazione energetica (art.6 d.lgs. 311/2006) – Attestato di collaudo e certificazioni di qualità  ","X",null,{"$f":"IF($H110=\"x\",IF(AND(I110>0,I110<9),K110,0),0)","v":{"v":0,"d":"0.000"}},{"v":0.05,"d":"0.050"},null,{"$f":"IF($H110=\"x\",IF(AND(L110>0,L110<9),N110,0),0)","v":{"v":0,"d":"0.000"}},{"v":0.05,"d":"0.050"},null,{"v":0,"d":"0.000"},{"v":0.05,"d":"0.050"},{"$nulls":6},{"$f":"IF(H110=\"X\",IF(I110=$X$20,ROUND(I$23*I$22*I$26*K110,2),0)+IF(L110=$X$20,ROUND(L$23*L$22*L$26*N110,2),0)+IF(O110=$X$20,ROUND(O$23*O$22*O$26*Q110,2),0)+IF(R110=$X$20,ROUND(R$23*R$22*R$26*T110,2),0),0)","v":{"v":0,"d":"0.00 €"}},{"$f":"IF(H110=\"X\",IF(I110=$Y$20,ROUND(I$23*I$22*I$26*K110,2),0)+IF(L110=$Y$20,ROUND(L$23*L$22*L$26*N110,2),0)+IF(O110=$Y$20,ROUND(O$23*O$22*O$26*Q110,2),0)+IF(R110=$Y$20,ROUND(R$23*R$22*R$26*T110,2),0),0)","v":{"v":0,"d":"0.00 €"}},{"$f":"IF(H110=\"X\",IF(I110=$Z$20,ROUND(I$23*I$22*I$26*K110,2),0)+IF(L110=$Z$20,ROUND(L$23*L$22*L$26*N110,2),0)+IF(O110=$Z$20,ROUND(O$23*O$22*O$26*Q110,2),0)+IF(R110=$Z$20,ROUND(R$23*R$22*R$26*T110,2),0),0)","v":{"v":0,"d":"0.00 €"}},{"$f":"IF(H110=\"X\",IF(I110=$AA$20,ROUND(I$23*I$22*I$26*K110,2),0)+IF(L110=$AA$20,ROUND(L$23*L$22*L$26*N110,2),0)+IF(O110=$AA$20,ROUND(O$23*O$22*O$26*Q110,2),0)+IF(R110=$AA$20,ROUND(R$23*R$22*R$26*T110,2),0),0)","v":{"v":0,"d":"0.00 €"}},{"$f":"IF(H110=\"X\",IF(I110=$AB$20,ROUND(I$23*I$22*I$26*K110,2),0)+IF(L110=$AB$20,ROUND(L$23*L$22*L$26*N110,2),0)+IF(O110=$AB$20,ROUND(O$23*O$22*O$26*Q110,2),0)+IF(R110=$AB$20,ROUND(R$23*R$22*R$26*T110,2),0),0)","v":{"v":0,"d":"0.00 €"}},{"$f":"IF(H110=\"X\",IF(I110=$AC$20,ROUND(I$23*I$22*I$26*K110,2),0)+IF(L110=$AC$20,ROUND(L$23*L$22*L$26*N110,2),0)+IF(O110=$AC$20,ROUND(O$23*O$22*O$26*Q110,2),0)+IF(R110=$AC$20,ROUND(R$23*R$22*R$26*T110,2),0),0)","v":{"v":0,"d":"0.00 €"}},{"$f":"IF(H110=\"X\",IF(I110=$AD$20,ROUND(I$23*I$22*I$26*K110,2),0)+IF(L110=$AD$20,ROUND(L$23*L$22*L$26*N110,2),0)+IF(O110=$AD$20,ROUND(O$23*O$22*O$26*Q110,2),0)+IF(R110=$AD$20,ROUND(R$23*R$22*R$26*T110,2),0),0)","v":{"v":0,"d":"0.00 €"}},{"$f":"IF(H110=\"X\",IF(I110=$AE$20,ROUND(I$23*I$22*I$26*K110,2),0)+IF(L110=$AE$20,ROUND(L$23*L$22*L$26*N110,2),0)+IF(O110=$AE$20,ROUND(O$23*O$22*O$26*Q110,2),0)+IF(R110=$AE$20,ROUND(R$23*R$22*R$26*T110,2),0),0)","v":{"v":0,"d":"0.00 €"}}]
[null,"totale incidenze",{"$nulls":3},"∑ Q i",{"$nulls":3},{"$f":"SUM(J106:J110)","v":{"v":0,"d":"0.000"}},{"$f":"J111","v":{"v":0,"d":"0.000"}},null,{"$f":"SUM(M106:M110)","v":{"v":0,"d":"0.000"}},{"$f":"M111","v":{"v":0,"d":"0.000"}},null,{"$f":"SUM(P106:P110)","v":{"v":0,"d":"0.000"}},{"$f":"P111","v":{"v":0,"d":"0.000"}},null,{"$f":"SUM(S106:S110)","v":{"v":0,"d":"0.000"}},{"$f":"S111","v":{"v":0,"d":"0.000"}},{"$nulls":12},{"$f":"I113-SUM(X106:AE110)","v":{"v":0,"d":"0.00 €"}}]
[null,"Compenso al netto di spese ed oneri CNPAIA",{"$nulls":3},"V*P*G*ΣQ",null,null,{"$f":"K111*I22*I23*I26","v":{"v":0,"d":"0.00 €"}},null,null,{"$f":"N111*L22*L23*L26","v":{"v":0,"d":"0.00 €"}},null,null,{"$f":"Q111*O22*O23*O26","v":{"v":0,"d":"0.00 €"}},null,null,{"$f":"T111*R22*R23*R26","v":{"v":0,"d":"0.00 €"}},{"$nulls":3},"eventuale aggiustamento\ndx-sx",null,{"$f":"AG111","v":{"v":0,"d":"0.00 €"}}]
[null,"COMPENSO AL NETTO DELLE SPESE",{"$nulls":6},{"$f":"ROUND(SUM(I112:T112),2)","v":{"v":0,"d":"0.00 €"}},{"$nulls":12},{"$f":"IF(I113=SUM(X113:AE113),\"OK\",\"CONTROLLA\")","v":"OK"},{"$f":"SUM(X113:AE113)-I113","v":{"v":0,"d":"0.00 €"}},{"$f":"SUM(X106:X112)","v":{"v":0,"d":"0.00 €"}},{"$f":"SUM(Y106:Y112)","v":{"v":0,"d":"0.00 €"}},{"v":0,"d":"0.00 €"},{"v":0,"d":"0.00 €"},{"v":0,"d":"0.00 €"},{"v":0,"d":"0.00 €"},{"v":0,"d":"0.00 €"},{"v":0,"d":"0.00 €"}]
[]
[null,"progetto preliminare",{"$nulls":6},{"$f":"I48","v":{"v":0,"d":"0.00 €"}},{"$nulls":12},{"$f":"IF(I115=SUM(X115:AE115),\"OK\",\"CONTROLLA\")","v":"OK"},{"$f":"SUM(X115:AE115)","v":{"v":0,"d":"0.00 €"}},{"$f":"X48","v":{"v":0,"d":"0.00 €"}},{"v":0,"d":"0.00 €"},{"v":0,"d":"0.00 €"},{"v":0,"d":"0.00 €"},{"v":0,"d":"0.00 €"},{"v":0,"d":"0.00 €"},{"v":0,"d":"0.00 €"},{"v":0,"d":"0.00 €"}]
[null,"progetto definitivo",{"$nulls":6},{"$f":"I74","v":{"v":0,"d":"0.00 €"}},{"$nulls":12},{"$f":"IF(I116=SUM(X116:AE116),\"OK\",\"CONTROLLA\")","v":"OK"},{"v":0,"d":"0.00 €"},{"$f":"X74","v":{"v":0,"d":"0.00 €"}},{"v":0,"d":"0.00 €"},{"v":0,"d":"0.00 €"},{"v":0,"d":"0.00 €"},{"v":0,"d":"0.00 €"},{"v":0,"d":"0.00 €"},{"v":0,"d":"0.00 €"},{"v":0,"d":"0.00 €"}]
[null,"progetto esecutivo",{"$nulls":6},{"$f":"I86","v":{"v":0,"d":"0.00 €"}},{"$nulls":12},{"$f":"IF(I117=SUM(X117:AE117),\"OK\",\"CONTROLLA\")","v":"OK"},{"v":0,"d":"0.00 €"},{"$f":"X86","v":{"v":0,"d":"0.00 €"}},{"v":0,"d":"0.00 €"},{"v":0,"d":"0.00 €"},{"v":0,"d":"0.00 €"},{"v":0,"d":"0.00 €"},{"v":0,"d":"0.00 €"},{"v":0,"d":"0.00 €"},{"v":0,"d":"0.00 €"}]
[null,"COMPENSO FASE PROGETTAZIONE",{"$nulls":6},{"$f":"SUM(I115:T117)","v":{"v":0,"d":"0.00 €"}},{"$nulls":13},{"v":0,"d":"0.00 €"},{"$f":"SUM(X115:X117)","v":{"v":0,"d":"0.00 €"}},{"$f":"SUM(Y115:Y117)","v":{"v":0,"d":"0.00 €"}},{"v":0,"d":"0.00 €"},{"v":0,"d":"0.00 €"},{"v":0,"d":"0.00 €"},{"v":0,"d":"0.00 €"},{"v":0,"d":"0.00 €"},{"v":0,"d":"0.00 €"}]
[null,"COMPENSO FASE ESECUZIONE",{"$nulls":6},{"$f":"I103","v":{"v":0,"d":"0.00 €"}},{"$nulls":12},{"$f":"IF(I119=SUM(X119:AE119),\"OK\",\"CONTROLLA\")","v":"OK"},{"v":0,"d":"0.00 €"},{"$f":"X103","v":{"v":0,"d":"0.00 €"}},{"v":0,"d":"0.00 €"},{"v":0,"d":"0.00 €"},{"v":0,"d":"0.00 €"},{"v":0,"d":"0.00 €"},{"v":0,"d":"0.00 €"},{"v":0,"d":"0.00 €"},{"v":0,"d":"0.00 €"}]
[null,"COMPENSO VERIFICHE E COLLAUDI",{"$nulls":6},{"$f":"I113","v":{"v":0,"d":"0.00 €"}},{"$nulls":12},{"$f":"IF(I120=SUM(X120:AE120),\"OK\",\"CONTROLLA\")","v":"OK"},{"v":0,"d":"0.00 €"},{"$f":"X113","v":{"v":0,"d":"0.00 €"}},{"v":0,"d":"0.00 €"},{"v":0,"d":"0.00 €"},{"v":0,"d":"0.00 €"},{"v":0,"d":"0.00 €"},{"v":0,"d":"0.00 €"},{"v":0,"d":"0.00 €"},{"v":0,"d":"0.00 €"}]
[]
[null,"TOTALE COMPENSO",{"$nulls":6},{"$f":"I118+I119+I120","v":{"v":0,"d":"0.00 €"}},{"$nulls":12},{"$f":"IF(I122=SUM(X122:AE122),\"OK\",\"CONTROLLA\")","v":"OK"},{"$f":"SUM(X122:AE122)","v":{"v":0,"d":"0.00 €"}},{"$f":"X120+X119+X118","v":{"v":0,"d":"0.00 €"}},{"$f":"Y120+Y119+Y118","v":{"v":0,"d":"0.00 €"}},{"v":0,"d":"0.00 €"},{"v":0,"d":"0.00 €"},{"v":0,"d":"0.00 €"},{"v":0,"d":"0.00 €"},{"v":0,"d":"0.00 €"},{"v":0,"d":"0.00 €"}]
[]
[null,"Riduzione del compenso \n(min secondo ordinanza 108/2020)",{"$nulls":5},{"v":0.3,"d":"30%"},{"$f":"-H124*(I118+I119+I120)","v":{"v":0,"d":"0.00"}},{"$nulls":12},{"$f":"IF(I124=SUM(X124:AE124),\"OK\",\"CONTROLLA\")","v":"OK"},{"$f":"SUM(X124:AE124)","v":{"v":0,"d":"0.00 €"}},{"$f":"-X122*0.3","v":{"v":0,"d":"0.00 €"}},{"$f":"-Y122*0.3","v":{"v":0,"d":"0.00 €"}},{"v":0,"d":"0.00 €"},{"v":0,"d":"0.00 €"},{"v":0,"d":"0.00 €"},{"v":0,"d":"0.00 €"},{"v":0,"d":"0.00 €"},{"v":0,"d":"0.00 €"}]
[null,"RSL",{"$nulls":3},"Prestazione all’analisi della risposta sismica locale. Comprensiva di tutte le attività inerenti la definizione del modello geologico e sismostratigrafico con indicati i parametri necessari per la definizione dell’azione sismica di progetto e l’eventuale verifica di cui all’ordinanza n. 55. Pari a 0,5% del valore dell'opera.",null,"X",null,{"$f":"IF($H125=\"x\",IF(AND(I125>0,I125<9),K125,0),0)","v":{"v":0,"d":"0.000"}},{"$f":"IF(H125=\"x\",SUM(I22:T22)*0.005,0)","v":{"v":0,"d":"0.00 €"}},{"$nulls":12},{"$f":"IF(H125=\"X\",IF(I125=1,J125,0),0)","v":{"v":0,"d":"0.00 €"}},{"$f":"IF(H125=\"X\",IF(I125=2,J125,0),0)","v":{"v":0,"d":"0.00 €"}},{"$f":"IF(H125=\"X\",IF(I125=3,J125,0),0)","v":{"v":0,"d":"0.00 €"}},{"$f":"IF(H125=\"X\",IF(I125=4,J125,0),0)","v":{"v":0,"d":"0.00 €"}},{"$f":"IF(H125=\"X\",IF(I125=5,J125,0),0)","v":{"v":0,"d":"0.00 €"}},{"$f":"IF(H125=\"X\",IF(I125=6,J125,0),0)","v":{"v":0,"d":"0.00 €"}},{"$f":"IF(H125=\"X\",IF(I125=7,J125,0),0)","v":{"v":0,"d":"0.00 €"}},{"$f":"IF(H125=\"X\",IF(I125=8,J125,0),0)","v":{"v":0,"d":"0.00 €"}}]
[null,"SPESE SU COMPENSO\n(suggerito masiimo secondo ordinanza 108 - modificabile)",{"$nulls":5},{"v":0.2,"d":"20%"},{"$f":"H126*I128","v":{"v":0,"d":"0.00 €"}}]
[]
[null,"TOTALE CORRISPETTIVO  SOGGETO A IVA E CNPAIA",{"$nulls":6},{"$f":"I122+I124+J125","v":{"v":0,"d":"0.00 €"}},{"$nulls":12},{"$f":"IF(I128=SUM(X128:AE128),\"OK\",\"CONTROLLA\")","v":"OK"},{"$f":"SUM(X128:AE128)","v":{"v":0,"d":"0.00 €"}},{"$f":"X122+X124+X125","v":{"v":0,"d":"0.00 €"}},{"$f":"Y122+Y124+Y125","v":{"v":0,"d":"0.00 €"}},{"v":0,"d":"0.00 €"},{"v":0,"d":"0.00 €"},{"v":0,"d":"0.00 €"},{"v":0,"d":"0.00 €"},{"v":0,"d":"0.00 €"},{"v":0,"d":"0.00 €"}]
[null,"MASSIME SPESE RENDICONTABILI IN SEDE DI SAL",{"$nulls":6},{"$f":"I126","v":{"v":0,"d":"0.00 €"}}]
[]
[null,"(1) L'importo del corrispettivo è inteso al netto degli oneri fiscali e previdenziali dovuti, come previsto da regime fiscale di riferimento"]
[{"$nulls":21},false,"."," "]
[{"$nulls":8},"EDILIZIA",null,null,"STRUT.",null,null,"I. IDRO-SA",null,null,"I. ELETTR.",{"$nulls":3},false,"."," "]
[null,"progetto preliminare",{"$nulls":6},{"$f":"K46*I26*I23*I22","v":{"v":0,"d":"0.00 €"}},null,null,{"$f":"N46*L26*L23*L22","v":{"v":0,"d":"0.00 €"}},null,null,{"$f":"Q46*O26*O23*O22","v":{"v":0,"d":"0.00 €"}},null,null,{"$f":"T46*R26*R23*R22","v":{"v":0,"d":"0.00 €"}}]
[null,"progetto definitivo",{"$nulls":6},{"$f":"K72*I22*I23*I26","v":{"v":0,"d":"0.00 €"}},null,null,{"$f":"N72*L22*L23*L26","v":{"v":0,"d":"0.00 €"}},null,null,{"$f":"Q72*O22*O23*O26","v":{"v":0,"d":"0.00 €"}},null,null,{"$f":"T72*R22*R23*R26","v":{"v":0,"d":"0.00 €"}}]
[null,"progetto esecutivo",{"$nulls":6},{"$f":"K84*I22*I23*I26","v":{"v":0,"d":"0.00 €"}},null,null,{"$f":"N84*L22*L23*L26","v":{"v":0,"d":"0.00 €"}},null,null,{"$f":"Q84*O22*O23*O26","v":{"v":0,"d":"0.00 €"}},null,null,{"$f":"T84*R22*R23*R26","v":{"v":0,"d":"0.00 €"}}]
[null,"COMPENSO FASE PROGETTAZIONE",{"$nulls":6},{"$f":"SUM(I134:K136)","v":{"v":0,"d":"0.00 €"}},null,null,{"$f":"SUM(L134:N136)","v":{"v":0,"d":"0.00 €"}},null,null,{"$f":"SUM(O134:Q136)","v":{"v":0,"d":"0.00 €"}},null,null,{"$f":"SUM(R134:T136)","v":{"v":0,"d":"0.00 €"}}]
[null,"COMPENSO FASE ESECUZIONE",{"$nulls":6},{"$f":"K101*I22*I23*I26","v":{"v":0,"d":"0.00 €"}},null,null,{"$f":"N101*L22*L23*L26","v":{"v":0,"d":"0.00 €"}},null,null,{"$f":"Q101*O22*O23*O26","v":{"v":0,"d":"0.00 €"}},null,null,{"$f":"T101*R22*R23*R26","v":{"v":0,"d":"0.00 €"}}]
[null,"COMPENSO VERIFICHE E COLLAUDI",{"$nulls":6},{"$f":"K111*I22*I23*I26","v":{"v":0,"d":"0.00 €"}},null,null,{"$f":"N111*L22*L23*L26","v":{"v":0,"d":"0.00 €"}},null,null,{"$f":"Q111*O22*O23*O26","v":{"v":0,"d":"0.00 €"}},null,null,{"$f":"T111*R22*R23*R26","v":{"v":0,"d":"0.00 €"}}]
[]
[null,"TOTALE COMPENSO",{"$nulls":6},{"$f":"SUM(I137:K139)","v":{"v":0,"d":"0.00 €"}},null,null,{"$f":"SUM(L137:N139)","v":{"v":0,"d":"0.00 €"}},null,null,{"$f":"SUM(O137:Q139)","v":{"v":0,"d":"0.00 €"}},null,null,{"$f":"SUM(R137:T139)","v":{"v":0,"d":"0.00 €"}}]
[]
[null,"Riduzione del compenso \n(min secondo ordinanza 108/2020)",{"$nulls":5},{"v":0.3,"d":"30%"},{"$f":"-I141*0.3","v":{"v":0,"d":"0.00 €"}},null,null,{"$f":"-L141*0.3","v":{"v":0,"d":"0.00 €"}},null,null,{"$f":"-O141*0.3","v":{"v":0,"d":"0.00 €"}},null,null,{"$f":"-R141*0.3","v":{"v":0,"d":"0.00 €"}}]
[null,"RSL",{"$nulls":3},"Prestazione all’analisi della risposta sismica locale. Comprensiva di tutte le attività inerenti la definizione del modello geologico e sismostratigrafico con indicati i parametri necessari per la definizione dell’azione sismica di progetto e l’eventuale verifica di cui all’ordinanza n. 55. Pari a 0,5% del valore dell'opera.",null,null,{"v":0,"d":"0.00 €"},null,null,{"$f":"K125","v":{"v":0,"d":"0.00 €"}},null,null,{"v":0,"d":"0.00 €"},null,null,{"v":0,"d":"0.00 €"}]
[]
[null,"TOTALE CORRISPETTIVO  SOGGETO A IVA E CNPAIA",{"$nulls":6},{"$f":"I141+I143+I144","v":{"v":0,"d":"0.00 €"}},null,null,{"$f":"L141+L143+L144","v":{"v":0,"d":"0.00 €"}},null,null,{"$f":"O141+O143+O144","v":{"v":0,"d":"0.00 €"}},null,null,{"$f":"R141+R143+R144","v":{"v":0,"d":"0.00 €"}}]
[null,"MASSIME SPESE RENDICONTABILI IN SEDE DI SAL",{"$nulls":6},{"$f":"ROUND(I146*$H$126,2)","v":{"v":0,"d":"0.00 €"}},null,null,{"$f":"ROUND(L146*$H$126,2)","v":{"v":0,"d":"0.00 €"}},null,null,{"$f":"ROUND(O146*$H$126,2)","v":{"v":0,"d":"0.00 €"}},null,null,{"$f":"ROUND(R146*$H$126,2)","v":{"v":0,"d":"0.00 €"}}]
[{"$nulls":6},"TOTALE",null,{"$f":"I147+I146","v":{"v":0,"d":"0.00 €"}},null,null,{"$f":"L147+L146","v":{"v":0,"d":"0.00 €"}},null,null,{"$f":"O147+O146","v":{"v":0,"d":"0.00 €"}},null,null,{"$f":"R147+R146","v":{"v":0,"d":"0.00 €"}}]

{"sheet":"DIVISIONE PER PROFESSIONISTA","index":2,"n_rows":132,"n_cols":24,"rows_kept":132,"merged":[[0,0,0,4],[0,5,0,18],[1,0,1,4],[1,5,1,18],[2,0,2,4],[2,5,2,18],[3,0,3,18],[4,0,4,18],[5,1,5,4],[5,5,5,6],[5,7,5,12],[5,13,5,18],[6,1,6,4],[6,5,6,6],[6,7,6,12],[6,13,6,18],[7,1,7,4],[7,5,7,6],[7,7,7,12],[7,13,7,18],[8,1,8,4],[8,5,8,6],[8,7,8,12],[8,13,8,18],[9,1,9,4],[9,5,9,6],[9,7,9,12],[9,13,9,18],[10,1,10,4],[10,5,10,6],[10,7,10,12],[10,13,10,18],[11,1,11,4],[11,5,11,6],[11,7,11,12],[11,13,11,18],[12,1,12,4],[12,5,12,6],[12,7,12,12],[12,13,12,18],[13,1,13,4],[13,5,13,6],[13,7,13,12],[13,13,13,18],[14,1,14,4],[14,5,14,6],[14,7,14,12],[14,13,14,18]]}
["COMMITTENTE:",{"$nulls":4},{"$f":"IF('Calcolo DM 140-12 + ORD. 108-20'!G1=\"\",\"\",'Calcolo DM 140-12 + ORD. 108-20'!G1)","v":""}]
["OGGETTO DELL'INCARICO:",{"$nulls":4},{"$f":"IF('Calcolo DM 140-12 + ORD. 108-20'!G2=\"\",\"\",'Calcolo DM 140-12 + ORD. 108-20'!G2)","v":""}]
["DANNO:",{"$nulls":4},{"$f":"IF('Calcolo DM 140-12 + ORD. 108-20'!G3=\"\",\"\",'Calcolo DM 140-12 + ORD. 108-20'!G3)","v":""}]
["CALCOLO DEI COMPENSI \nI compensi sono calcolati sulla base del D.M. GIUSTIZIA 20/07/2012, n. 140 \"Regolamento recante la determinazione dei parametri per la liquidazione da parte di un organo giurisdizionale dei compensi per le professioni regolamentate vigilate dal Ministero della giustizia, ai sensi dell’articolo 9 del decreto-legge 24 gennaio 2012 n. 1 convertito con modificazioni dalla legge 24 marzo 2012 n. 27.\"\nCosì come previsto dall'ordinanza 108/2020 del Commisario per la Ricostruzione post- sisma 2016"]
["RIPARTIZIONE DELL'ONORARIO FRA I SOGGETTI PREVISTI DALL'ORD. 108/2020"]
[null,"PROFESSIONISTA",{"$nulls":3},"TITOLO NOME E COGNOME",null,"ONORARIO",{"$nulls":5},"SPESE"]
[1,"COORDINATORE",{"$nulls":3},{"$f":"'Calcolo DM 140-12 + ORD. 108-20'!G8","v":0},null,{"$f":"'Calcolo DM 140-12 + ORD. 108-20'!I8","v":{"v":0,"d":"0.00 €"}}]
[2,"DIRETTORE DEI LAVORI",{"$nulls":3},{"$f":"'Calcolo DM 140-12 + ORD. 108-20'!G9","v":0},null,{"$f":"'Calcolo DM 140-12 + ORD. 108-20'!I9","v":{"v":0,"d":"0.00 €"}}]
[3,"ALTRO PROFESSIONISTA 1",{"$nulls":3},{"$f":"'Calcolo DM 140-12 + ORD. 108-20'!G10","v":0},null,{"$f":"'Calcolo DM 140-12 + ORD. 108-20'!I10","v":{"v":0,"d":"0.00 €"}}]
[4,"ALTRO PROFESSIONISTA 2",{"$nulls":3},{"$f":"'Calcolo DM 140-12 + ORD. 108-20'!G11","v":0},null,{"$f":"'Calcolo DM 140-12 + ORD. 108-20'!I11","v":{"v":0,"d":"0.00 €"}}]
[5,"SICUREZZA PROGETTO",{"$nulls":3},{"$f":"'Calcolo DM 140-12 + ORD. 108-20'!G12","v":0},null,{"$f":"'Calcolo DM 140-12 + ORD. 108-20'!I12","v":{"v":0,"d":"0.00 €"}}]
[6,"SICUREZZA ESECUZIONE",{"$nulls":3},{"$f":"'Calcolo DM 140-12 + ORD. 108-20'!G13","v":0},null,{"$f":"'Calcolo DM 140-12 + ORD. 108-20'!I13","v":{"v":0,"d":"0.00 €"}}]
[7,"COLLAUDATORE",{"$nulls":3},{"$f":"'Calcolo DM 140-12 + ORD. 108-20'!G14","v":0},null,{"$f":"'Calcolo DM 140-12 + ORD. 108-20'!I14","v":{"v":0,"d":"0.00 €"}}]
[8,"GEOLOGO",{"$nulls":3},{"$f":"'Calcolo DM 140-12 + ORD. 108-20'!G15","v":0},null,{"$f":"'Calcolo DM 140-12 + ORD. 108-20'!I15","v":{"v":0,"d":"0.00 €"}}]
[null,"TOTALE",{"$nulls":5},{"$f":"'Calcolo DM 140-12 + ORD. 108-20'!I16","v":{"v":0,"d":"0.00 €"}},{"$nulls":5},{"$f":"'Calcolo DM 140-12 + ORD. 108-20'!O16","v":{"v":0,"d":"0.00 €"}}]
{"$rows_empty":116}
[{"$nulls":21},false,"."," "]

{"sheet":"DIVISIONE PER CATEGORIA","index":3,"n_rows":20,"n_cols":17,"rows_kept":20,"merged":[[0,0,0,4],[0,5,0,18],[1,0,1,4],[1,5,1,18],[2,0,2,4],[2,5,2,18],[3,0,3,18],[4,7,4,9],[4,10,4,12],[4,13,4,15],[4,16,4,18],[5,0,5,5],[5,7,5,9],[5,10,5,12],[5,13,5,15],[5,16,5,18],[6,0,6,5],[6,7,6,9],[6,10,6,12],[6,13,6,15],[6,16,6,18],[7,0,7,5],[7,7,7,9],[7,10,7,12],[7,13,7,15],[7,16,7,18],[8,0,8,5],[8,7,8,9],[8,10,8,12],[8,13,8,15],[8,16,8,18],[9,0,9,5],[9,7,9,9],[9,10,9,12],[9,13,9,15],[9,16,9,18],[10,0,10,5],[10,7,10,9],[10,10,10,12],[10,13,10,15],[10,16,10,18],[12,0,12,5],[12,7,12,9],[12,10,12,12],[12,13,12,15],[12,16,12,18],[14,0,14,5],[14,7,14,9],[14,10,14,12],[14,13,14,15],[14,16,14,18],[15,0,15,3],[15,4,15,5],[15,7,15,9],[15,10,15,12],[15,13,15,15],[15,16,15,18],[17,0,17,6],[17,7,17,9],[17,10,17,12],[17,13,17,15],[17,16,17,18],[18,0,18,6],[18,7,18,9],[18,10,18,12],[18,13,18,15],[18,16,18,18],[19,5,19,6],[19,7,19,9],[19,10,19,12],[19,13,19,15],[19,16,19,18]]}
["COMMITTENTE:",{"$nulls":4},{"$f":"IF('Calcolo DM 140-12 + ORD. 108-20'!G1=\"\",\"\",'Calcolo DM 140-12 + ORD. 108-20'!G1)","v":""}]
["OGGETTO DELL'INCARICO:",{"$nulls":4},{"$f":"IF('Calcolo DM 140-12 + ORD. 108-20'!G2=\"\",\"\",'Calcolo DM 140-12 + ORD. 108-20'!G2)","v":""}]
["DANNO:",{"$nulls":4},{"$f":"IF('Calcolo DM 140-12 + ORD. 108-20'!G3=\"\",\"\",'Calcolo DM 140-12 + ORD. 108-20'!G3)","v":""}]
["CALCOLO DEI COMPENSI \nI compensi sono calcolati sulla base del D.M. GIUSTIZIA 20/07/2012, n. 140 \"Regolamento recante la determinazione dei parametri per la liquidazione da parte di un organo giurisdizionale dei compensi per le professioni regolamentate vigilate dal Ministero della giustizia, ai sensi dell’articolo 9 del decreto-legge 24 gennaio 2012 n. 1 convertito con modificazioni dalla legge 24 marzo 2012 n. 27.\"\nCosì come previsto dall'ordinanza 108/2020 del Commisario per la Ricostruzione post- sisma 2016"]
[{"$nulls":7},"EDILIZIA",null,null,"STRUT.",null,null,"I. IDRO-SA",null,null,"I. ELETTR."]
["progetto preliminare",{"$nulls":6},{"$f":"'Calcolo DM 140-12 + ORD. 108-20'!I134","v":{"v":0,"d":"0.00 €"}},null,null,{"$f":"'Calcolo DM 140-12 + ORD. 108-20'!L134","v":{"v":0,"d":"0.00 €"}},null,null,{"$f":"'Calcolo DM 140-12 + ORD. 108-20'!O134","v":{"v":0,"d":"0.00 €"}},null,null,{"$f":"'Calcolo DM 140-12 + ORD. 108-20'!R134","v":{"v":0,"d":"0.00 €"}}]
["progetto definitivo",{"$nulls":6},{"$f":"'Calcolo DM 140-12 + ORD. 108-20'!I135","v":{"v":0,"d":"0.00 €"}},null,null,{"$f":"'Calcolo DM 140-12 + ORD. 108-20'!L135","v":{"v":0,"d":"0.00 €"}},null,null,{"$f":"'Calcolo DM 140-12 + ORD. 108-20'!O135","v":{"v":0,"d":"0.00 €"}},null,null,{"$f":"'Calcolo DM 140-12 + ORD. 108-20'!R135","v":{"v":0,"d":"0.00 €"}}]
["progetto esecutivo",{"$nulls":6},{"$f":"'Calcolo DM 140-12 + ORD. 108-20'!I136","v":{"v":0,"d":"0.00 €"}},null,null,{"$f":"'Calcolo DM 140-12 + ORD. 108-20'!L136","v":{"v":0,"d":"0.00 €"}},null,null,{"$f":"'Calcolo DM 140-12 + ORD. 108-20'!O136","v":{"v":0,"d":"0.00 €"}},null,null,{"$f":"'Calcolo DM 140-12 + ORD. 108-20'!R136","v":{"v":0,"d":"0.00 €"}}]
["COMPENSO FASE PROGETTAZIONE",{"$nulls":6},{"$f":"'Calcolo DM 140-12 + ORD. 108-20'!I137","v":{"v":0,"d":"0.00 €"}},null,null,{"$f":"'Calcolo DM 140-12 + ORD. 108-20'!L137","v":{"v":0,"d":"0.00 €"}},null,null,{"$f":"'Calcolo DM 140-12 + ORD. 108-20'!O137","v":{"v":0,"d":"0.00 €"}},null,null,{"$f":"'Calcolo DM 140-12 + ORD. 108-20'!R137","v":{"v":0,"d":"0.00 €"}}]
["COMPENSO FASE ESECUZIONE",{"$nulls":6},{"$f":"'Calcolo DM 140-12 + ORD. 108-20'!I138","v":{"v":0,"d":"0.00 €"}},null,null,{"$f":"'Calcolo DM 140-12 + ORD. 108-20'!L138","v":{"v":0,"d":"0.00 €"}},null,null,{"$f":"'Calcolo DM 140-12 + ORD. 108-20'!O138","v":{"v":0,"d":"0.00 €"}},null,null,{"$f":"'Calcolo DM 140-12 + ORD. 108-20'!R138","v":{"v":0,"d":"0.00 €"}}]
["COMPENSO VERIFICHE E COLLAUDI",{"$nulls":6},{"$f":"'Calcolo DM 140-12 + ORD. 108-20'!I139","v":{"v":0,"d":"0.00 €"}},null,null,{"$f":"'Calcolo DM 140-12 + ORD. 108-20'!L139","v":{"v":0,"d":"0.00 €"}},null,null,{"$f":"'Calcolo DM 140-12 + ORD. 108-20'!O139","v":{"v":0,"d":"0.00 €"}},null,null,{"$f":"'Calcolo DM 140-12 + ORD. 108-20'!R139","v":{"v":0,"d":"0.00 €"}}]
[]
["TOTALE COMPENSO",{"$nulls":6},{"$f":"'Calcolo DM 140-12 + ORD. 108-20'!I141","v":{"v":0,"d":"0.00 €"}},null,null,{"$f":"'Calcolo DM 140-12 + ORD. 108-20'!L141","v":{"v":0,"d":"0.00 €"}},null,null,{"$f":"'Calcolo DM 140-12 + ORD. 108-20'!O141","v":{"v":0,"d":"0.00 €"}},null,null,{"$f":"'Calcolo DM 140-12 + ORD. 108-20'!R141","v":{"v":0,"d":"0.00 €"}}]
[]
["Riduzione del compenso \n(min secondo ordinanza 108/2020)",{"$nulls":5},{"v":0.3,"d":"30%"},{"$f":"'Calcolo DM 140-12 + ORD. 108-20'!I143","v":{"v":0,"d":"0.00 €"}},null,null,{"$f":"'Calcolo DM 140-12 + ORD. 108-20'!L143","v":{"v":0,"d":"0.00 €"}},null,null,{"$f":"'Calcolo DM 140-12 + ORD. 108-20'!O143","v":{"v":0,"d":"0.00 €"}},null,null,{"$f":"'Calcolo DM 140-12 + ORD. 108-20'!R143","v":{"v":0,"d":"0.00 €"}}]
["RSL",{"$nulls":3},"Prestazione all’analisi della risposta sismica locale. Comprensiva di tutte le attività inerenti la definizione del modello geologico e sismostratigrafico con indicati i parametri necessari per la definizione dell’azione sismica di progetto e l’eventuale verifica di cui all’ordinanza n. 55. Pari a 0,5% del valore dell'opera.",null,null,{"$f":"'Calcolo DM 140-12 + ORD. 108-20'!I144","v":{"v":0,"d":"0.00 €"}},null,null,{"$f":"'Calcolo DM 140-12 + ORD. 108-20'!L144","v":{"v":0,"d":"0.00 €"}},null,null,{"$f":"'Calcolo DM 140-12 + ORD. 108-20'!O144","v":{"v":0,"d":"0.00 €"}},null,null,{"$f":"'Calcolo DM 140-12 + ORD. 108-20'!R144","v":{"v":0,"d":"0.00 €"}}]
[]
["TOTALE CORRISPETTIVO  SOGGETO A IVA E CNPAIA",{"$nulls":6},{"$f":"'Calcolo DM 140-12 + ORD. 108-20'!I146","v":{"v":0,"d":"0.00 €"}},null,null,{"$f":"'Calcolo DM 140-12 + ORD. 108-20'!L146","v":{"v":0,"d":"0.00 €"}},null,null,{"$f":"'Calcolo DM 140-12 + ORD. 108-20'!O146","v":{"v":0,"d":"0.00 €"}},null,null,{"$f":"'Calcolo DM 140-12 + ORD. 108-20'!R146","v":{"v":0,"d":"0.00 €"}}]
["MASSIME SPESE RENDICONTABILI IN SEDE DI SAL",{"$nulls":6},{"$f":"'Calcolo DM 140-12 + ORD. 108-20'!I147","v":{"v":0,"d":"0.00 €"}},null,null,{"$f":"'Calcolo DM 140-12 + ORD. 108-20'!L147","v":{"v":0,"d":"0.00 €"}},null,null,{"$f":"'Calcolo DM 140-12 + ORD. 108-20'!O147","v":{"v":0,"d":"0.00 €"}},null,null,{"$f":"'Calcolo DM 140-12 + ORD. 108-20'!R147","v":{"v":0,"d":"0.00 €"}}]
[{"$nulls":5},"TOTALE",null,{"$f":"'Calcolo DM 140-12 + ORD. 108-20'!I148","v":{"v":0,"d":"0.00 €"}},null,null,{"$f":"'Calcolo DM 140-12 + ORD. 108-20'!L148","v":{"v":0,"d":"0.00 €"}},null,null,{"$f":"'Calcolo DM 140-12 + ORD. 108-20'!O148","v":{"v":0,"d":"0.00 €"}},null,null,{"$f":"'Calcolo DM 140-12 + ORD. 108-20'!R148","v":{"v":0,"d":"0.00 €"}}]

{"sheet":"CONSEGNA UFFICI","index":4,"n_rows":132,"n_cols":38,"rows_kept":132,"merged":[[0,1,0,5],[0,6,0,18],[1,1,1,5],[1,6,1,18],[2,1,2,5],[2,6,2,18],[3,1,3,18],[5,1,5,6],[6,1,6,6],[6,7,6,18],[7,1,7,6],[7,7,7,9],[7,10,7,12],[7,13,7,15],[7,16,7,18],[8,1,8,4],[8,7,8,9],[8,10,8,12],[8,13,8,15],[8,16,8,18],[9,1,9,4],[9,7,9,9],[9,10,9,12],[9,13,9,15],[9,16,9,18],[10,1,10,6],[10,7,10,9],[10,10,10,12],[10,13,10,15],[10,16,10,18],[10,22,13,22],[10,23,13,23],[10,24,13,24],[10,25,13,25],[10,26,13,26],[10,27,13,27],[10,28,13,28],[10,29,13,29],[11,1,12,4],[11,5,12,5],[11,6,12,6],[11,7,11,9],[11,10,11,12],[11,13,11,15],[11,16,11,18],[12,7,12,9],[12,10,12,12],[12,13,12,15],[12,16,12,18],[14,7,14,18],[15,1,15,6],[15,7,15,9],[15,10,15,12],[15,13,15,15],[15,16,15,18],[15,22,15,29],[16,1,31,1],[16,2,31,2],[16,3,31,3],[16,4,31,4],[32,1,32,4],[32,5,32,6],[33,1,33,4],[33,5,33,6],[33,7,33,9],[33,10,33,12],[33,13,33,15],[33,16,33,18],[33,20,33,21],[34,1,34,6],[34,7,34,18],[36,1,36,6],[36,7,36,9],[36,10,36,12],[36,13,36,15],[36,16,36,18],[36,22,36,29],[37,1,57,1],[37,2,57,2],[37,3,57,3],[37,4,57,4],[47,7,47,9],[47,13,47,15],[47,16,47,18],[48,7,48,9],[48,13,48,15],[48,16,48,18],[49,7,49,9],[49,13,49,15],[49,16,49,18],[58,1,58,4],[58,5,58,6],[59,1,59,4],[59,5,59,6],[59,7,59,9],[59,10,59,12],[59,13,59,15],[59,16,59,18],[59,20,59,21],[60,1,60,6],[60,7,60,18],[62,1,62,6],[62,7,62,9],[62,10,62,12],[62,13,62,15],[62,16,62,18],[62,22,62,29],[63,1,69,1],[63,2,69,2],[63,3,69,3],[63,4,69,4],[70,1,70,4],[70,5,70,6],[71,1,71,4],[71,5,71,6],[71,7,71,9],[71,10,71,12],[71,13,71,15],[71,16,71,18],[71,20,71,21],[72,1,72,6],[72,7,72,18],[74,1,74,6],[74,7,74,9],[74,10,74,12],[74,13,74,15],[74,16,74,18],[74,22,74,29],[75,1,86,1],[75,2,86,2],[75,3,86,3],[75,4,86,4],[87,1,87,4],[87,5,87,6],[88,1,88,4],[88,5,88,6],[88,7,88,9],[88,10,88,12],[88,13,88,15],[88,16,88,18],[88,20,88,21],[89,1,89,6],[89,7,89,18],[91,1,91,6],[91,7,91,9],[91,10,91,12],[91,13,91,15],[91,16,91,18],[91,22,91,29],[92,1,96,1],[92,2,96,2],[92,3,96,3],[92,4,96,4],[92,16,92,18],[93,16,93,18],[94,7,94,9],[94,13,94,15],[94,16,94,18],[95,7,95,9],[95,10,95,12],[95,16,95,18],[96,16,96,18],[97,1,97,4],[97,5,97,6],[98,1,98,4],[98,5,98,6],[98,7,98,9],[98,10,98,12],[98,13,98,15],[98,16,98,18],[98,20,98,21],[99,1,99,6],[99,7,99,18],[101,1,101,6],[101,8,101,18],[102,1,102,6],[102,8,102,18],[103,1,103,6],[103,8,103,18],[104,1,104,6],[104,8,104,18],[105,1,105,6],[105,8,105,18],[106,1,106,6],[106,8,106,18],[108,1,108,6],[108,8,108,18],[110,1,110,6],[110,8,110,18],[111,1,111,4],[111,5,111,6],[111,8,111,18],[112,1,112,6],[112,8,112,18],[114,1,114,6],[114,8,114,18],[115,1,115,6],[115,8,115,18],[116,1,116,18],[117,1,117,18]]}
[null,"COMMITTENTE:",{"$nulls":4},{"$f":"IF('Calcolo DM 140-12 + ORD. 108-20'!G1=\"\",\"\",'Calcolo DM 140-12 + ORD. 108-20'!G1)","v":""}]
[null,"OGGETTO DELL'INCARICO:",{"$nulls":4},{"$f":"IF('Calcolo DM 140-12 + ORD. 108-20'!G2=\"\",\"\",'Calcolo DM 140-12 + ORD. 108-20'!G2)","v":""}]
[null,"DANNO:",{"$nulls":4},{"$f":"IF('Calcolo DM 140-12 + ORD. 108-20'!G3=\"\",\"\",'Calcolo DM 140-12 + ORD. 108-20'!G3)","v":""}]
[null,"CALCOLO DEI COMPENSI \nI compensi sono calcolati sulla base del D.M. GIUSTIZIA 20/07/2012, n. 140 \"Regolamento recante la determinazione dei parametri per la liquidazione da parte di un organo giurisdizionale dei compensi per le professioni regolamentate vigilate dal Ministero della giustizia, ai sensi dell’articolo 9 del decreto-legge 24 gennaio 2012 n. 1 convertito con modificazioni dalla legge 24 marzo 2012 n. 27.\"\nCosì come previsto dall'ordinanza 108/2020 del Commisario per la Ricostruzione post- sisma 2016"]
[]
[null,"IMPORTI DI RIFERIMENTO A BASE DI CALCOLO:"]
[{"$nulls":7},"Categorie",{"$nulls":14},1,2,3,4,5,6,7,8]
[null,"Modalità di compilazione:\n- Inserire il valore delle opere per ciascuna categoria\n- Scegliere la destinazione funzionale delle opere\n- Inserire il grado di complessità \n- Digitare \"X\" nell'apposita colonna per attivare tutte le prestazioni\n- Inserire il progettista nella casella di fianco alla singola prestazione (numero d'ordine 1,2 ...)",{"$nulls":5},"Edilizia",null,null,"Strutture",null,null,"Impianto  \nTermo-Idraulico",null,null,"Impianto \nElettrico",{"$nulls":5},"COORDINATORE","DIRETTORE DEI LAVORI","SPECIALISTA 1","SPECIALISTA 2","SICUREZZA PROGETTO","SICUREZZA ESECUZIONE","COLLAUDATORE","GEOLOGO"]
[null,"Valore opera",{"$nulls":3},"V",{"$f":"CONCATENATE(\"Importo complessivo opere: \n€ \",TEXT(SUM(H9:S9),\"### ##0.00\"))","v":"Importo complessivo opere: \n€  000"},{"$f":"'Calcolo DM 140-12 + ORD. 108-20'!I22","v":{"v":0,"d":"0.00 €"}},null,null,{"$f":"'Calcolo DM 140-12 + ORD. 108-20'!L22","v":{"v":0,"d":"0.00 €"}},null,null,{"$f":"'Calcolo DM 140-12 + ORD. 108-20'!O22","v":{"v":0,"d":"0.00 €"}},null,null,{"$f":"'Calcolo DM 140-12 + ORD. 108-20'!R22","v":{"v":0,"d":"0.00 €"}}]
[null,"Parametro",{"$nulls":3},"P",null,{"$f":"'Calcolo DM 140-12 + ORD. 108-20'!I23","v":"0"},null,null,{"$f":"'Calcolo DM 140-12 + ORD. 108-20'!L23","v":"0"},null,null,{"$f":"'Calcolo DM 140-12 + ORD. 108-20'!O23","v":"0"},null,null,{"$f":"'Calcolo DM 140-12 + ORD. 108-20'!R23","v":"0"}]
[null,"Destinazione funzionale delle opere",{"$nulls":5},{"$f":"'Calcolo DM 140-12 + ORD. 108-20'!I24","v":0},null,null,{"$f":"'Calcolo DM 140-12 + ORD. 108-20'!L24","v":0},null,null,{"$f":"'Calcolo DM 140-12 + ORD. 108-20'!O24","v":0},null,null,{"$f":"'Calcolo DM 140-12 + ORD. 108-20'!R24","v":0},{"$nulls":5},"COORDINATORE","DIRETTORE DEI LAVORI","SPECIALISTA 1","SPECIALISTA 2","SICUREZZA PROGETTO","SICUREZZA ESECUZIONE","COLLAUDATORE","GEOLOGO",{"$nulls":3},"---"]
[null,"Complessità",{"$nulls":3},"G","Grado di complessità (min-medio-max)",{"$f":"'Calcolo DM 140-12 + ORD. 108-20'!I25","v":""},null,null,{"$f":"'Calcolo DM 140-12 + ORD. 108-20'!L25","v":""},null,null,{"$f":"'Calcolo DM 140-12 + ORD. 108-20'!O25","v":""},null,null,{"$f":"'Calcolo DM 140-12 + ORD. 108-20'!R25","v":""},{"$nulls":16},"1. DEMOLIZIONE E RICOSTRUZIONE"]
[{"$nulls":7},{"$f":"'Calcolo DM 140-12 + ORD. 108-20'!I26","v":0},null,null,{"$f":"'Calcolo DM 140-12 + ORD. 108-20'!L26","v":0},null,null,{"$f":"'Calcolo DM 140-12 + ORD. 108-20'!O26","v":0},null,null,{"$f":"'Calcolo DM 140-12 + ORD. 108-20'!R26","v":0},{"$nulls":16},"2. MIGLIORAMENTO/ADEGUAMENTO SISMICO"]
[{"$nulls":33},"3. MIGLIORAMENTO EDIFICIO VINCOLATO"]
[{"$nulls":22},1,2,3,4,5,6,7,8,{"$nulls":3},"4. DANNI LIEVI - L0",{"$nulls":3},5]
[null,"PROGETTAZIONE PRELIMINARE",{"$nulls":5},"Edilizia",null,null,"Strutture",null,null,"Impianto Elettrico",null,null,"Impianto Termo-Idrau",{"$nulls":5},"PROGETTAZIONE PRELIMINARE",{"$nulls":10},1,2,3,4,1]
[{"$f":"IF(OR(H17<>\"\",K17<>\"\",N17<>\"\",Q17<>\"\"),\"\",1)","v":1},"PROGETTAZIONE","b.I)\nPROGETTAZIONE PRELIMINARE","prestazioni affidate","incidenza Q","QbI.01\nQpf.01","Relazioni, planimetrie, elaborati grafici (art.17, comma1, lettere a), b), e), d.P.R. 207/10)  ",{"$f":"IF(AND('Calcolo DM 140-12 + ORD. 108-20'!I30<9,'Calcolo DM 140-12 + ORD. 108-20'!I30>0),\"X\",\"\")","v":""},{"$f":"IF(H17=\"X\",J17,0)","v":{"v":0,"d":"0.000"}},{"v":0.09,"d":"0.090"},{"$f":"IF(AND('Calcolo DM 140-12 + ORD. 108-20'!L30<9,'Calcolo DM 140-12 + ORD. 108-20'!L30>0),\"X\",\"\")","v":""},{"$f":"IF(K17=\"X\",M17,0)","v":{"v":0,"d":"0.000"}},{"v":0.09,"d":"0.090"},{"$f":"IF(AND('Calcolo DM 140-12 + ORD. 108-20'!O30<9,'Calcolo DM 140-12 + ORD. 108-20'!O30>0),\"X\",\"\")","v":""},{"$f":"IF(N17=\"X\",P17,0)","v":{"v":0,"d":"0.000"}},{"v":0.09,"d":"0.090"},{"$f":"IF(AND('Calcolo DM 140-12 + ORD. 108-20'!R30<9,'Calcolo DM 140-12 + ORD. 108-20'!R30>0),\"X\",\"\")","v":""},{"$f":"IF(Q17=\"X\",S17,0)","v":{"v":0,"d":"0.000"}},{"v":0.09,"d":"0.090"},{"$nulls":3},{"$f":"IF(#REF!=\"X\",IF(H17=$W$7,ROUND(H$10*H$9*H$13*J17,2),0)+IF(K17=$W$7,ROUND(K$10*K$9*K$13*M17,2),0)+IF(N17=$W$7,ROUND(N$10*N$9*N$13*P17,2),0)+IF(Q17=$W$7,ROUND(Q$10*Q$9*Q$13*S17,2),0),0)","v":{"$error":"#REF!"}},{"$f":"IF(#REF!=\"X\",IF(H17=$X$7,ROUND(H$10*H$9*H$13*J17,2),0)+IF(K17=$X$7,ROUND(K$10*K$9*K$13*M17,2),0)+IF(N17=$X$7,ROUND(N$10*N$9*N$13*P17,2),0)+IF(Q17=$X$7,ROUND(Q$10*Q$9*Q$13*S17,2),0),0)","v":{"$error":"#REF!"}},{"$f":"IF(#REF!=\"X\",IF(H17=$Y$7,ROUND(H$10*H$9*H$13*J17,2),0)+IF(K17=$Y$7,ROUND(K$10*K$9*K$13*M17,2),0)+IF(N17=$Y$7,ROUND(N$10*N$9*N$13*P17,2),0)+IF(Q17=$Y$7,ROUND(Q$10*Q$9*Q$13*S17,2),0),0)","v":{"$error":"#REF!"}},{"$f":"IF(#REF!=\"X\",IF(H17=$Z$7,ROUND(H$10*H$9*H$13*J17,2),0)+IF(K17=$Z$7,ROUND(K$10*K$9*K$13*M17,2),0)+IF(N17=$Z$7,ROUND(N$10*N$9*N$13*P17,2),0)+IF(Q17=$Z$7,ROUND(Q$10*Q$9*Q$13*S17,2),0),0)","v":{"$error":"#REF!"}},{"$f":"IF(#REF!=\"X\",IF(H17=$AA$7,ROUND(H$10*H$9*H$13*J17,2),0)+IF(K17=$AA$7,ROUND(K$10*K$9*K$13*M17,2),0)+IF(N17=$AA$7,ROUND(N$10*N$9*N$13*P17,2),0)+IF(Q17=$AA$7,ROUND(Q$10*Q$9*Q$13*S17,2),0),0)","v":{"$error":"#REF!"}},{"$f":"IF(#REF!=\"X\",IF(H17=$AB$7,ROUND(H$10*H$9*H$13*J17,2),0)+IF(K17=$AB$7,ROUND(K$10*K$9*K$13*M17,2),0)+IF(N17=$AB$7,ROUND(N$10*N$9*N$13*P17,2),0)+IF(Q17=$AB$7,ROUND(Q$10*Q$9*Q$13*S17,2),0),0)","v":{"$error":"#REF!"}},{"$f":"IF(#REF!=\"X\",IF(H17=$AC$7,ROUND(H$10*H$9*H$13*J17,2),0)+IF(K17=$AC$7,ROUND(K$10*K$9*K$13*M17,2),0)+IF(N17=$AC$7,ROUND(N$10*N$9*N$13*P17,2),0)+IF(Q17=$AC$7,ROUND(Q$10*Q$9*Q$13*S17,2),0),0)","v":{"$error":"#REF!"}},{"$f":"IF(#REF!=\"X\",IF(H17=$AD$7,ROUND(H$10*H$9*H$13*J17,2),0)+IF(K17=$AD$7,ROUND(K$10*K$9*K$13*M17,2),0)+IF(N17=$AD$7,ROUND(N$10*N$9*N$13*P17,2),0)+IF(Q17=$AD$7,ROUND(Q$10*Q$9*Q$13*S17,2),0),0)","v":{"$error":"#REF!"}},{"$nulls":3},"X","X","X","X"]
[{"$f":"IF(OR(H18<>\"\",K18<>\"\",N18<>\"\",Q18<>\"\"),\"\",1)","v":1},{"$nulls":4}," QbI.02  ","Calcolo sommario spesa, quadro economico di progetto (art.17, comma 1, lettere g), h), d.P.R. 207/10)  ",{"$f":"IF(AND('Calcolo DM 140-12 + ORD. 108-20'!I31<9,'Calcolo DM 140-12 + ORD. 108-20'!I31>0),\"X\",\"\")","v":""},{"$f":"IF(H18=\"X\",J18,0)","v":{"v":0,"d":"0.000"}},{"v":0.01,"d":"0.010"},{"$f":"IF(AND('Calcolo DM 140-12 + ORD. 108-20'!L31<9,'Calcolo DM 140-12 + ORD. 108-20'!L31>0),\"X\",\"\")","v":""},{"$f":"IF(K18=\"X\",M18,0)","v":{"v":0,"d":"0.000"}},{"v":0.01,"d":"0.010"},{"$f":"IF(AND('Calcolo DM 140-12 + ORD. 108-20'!O31<9,'Calcolo DM 140-12 + ORD. 108-20'!O31>0),\"X\",\"\")","v":""},{"$f":"IF(N18=\"X\",P18,0)","v":{"v":0,"d":"0.000"}},{"v":0.01,"d":"0.010"},{"$f":"IF(AND('Calcolo DM 140-12 + ORD. 108-20'!R31<9,'Calcolo DM 140-12 + ORD. 108-20'!R31>0),\"X\",\"\")","v":""},{"$f":"IF(Q18=\"X\",S18,0)","v":{"v":0,"d":"0.000"}},{"v":0.01,"d":"0.010"},{"$nulls":3},{"$f":"IF(#REF!=\"X\",IF(H18=$W$7,ROUND(H$10*H$9*H$13*J18,2),0)+IF(K18=$W$7,ROUND(K$10*K$9*K$13*M18,2),0)+IF(N18=$W$7,ROUND(N$10*N$9*N$13*P18,2),0)+IF(Q18=$W$7,ROUND(Q$10*Q$9*Q$13*S18,2),0),0)","v":{"$error":"#REF!"}},{"$f":"IF(#REF!=\"X\",IF(H18=$X$7,ROUND(H$10*H$9*H$13*J18,2),0)+IF(K18=$X$7,ROUND(K$10*K$9*K$13*M18,2),0)+IF(N18=$X$7,ROUND(N$10*N$9*N$13*P18,2),0)+IF(Q18=$X$7,ROUND(Q$10*Q$9*Q$13*S18,2),0),0)","v":{"$error":"#REF!"}},{"$f":"IF(#REF!=\"X\",IF(H18=$Y$7,ROUND(H$10*H$9*H$13*J18,2),0)+IF(K18=$Y$7,ROUND(K$10*K$9*K$13*M18,2),0)+IF(N18=$Y$7,ROUND(N$10*N$9*N$13*P18,2),0)+IF(Q18=$Y$7,ROUND(Q$10*Q$9*Q$13*S18,2),0),0)","v":{"$error":"#REF!"}},{"$f":"IF(#REF!=\"X\",IF(H18=$Z$7,ROUND(H$10*H$9*H$13*J18,2),0)+IF(K18=$Z$7,ROUND(K$10*K$9*K$13*M18,2),0)+IF(N18=$Z$7,ROUND(N$10*N$9*N$13*P18,2),0)+IF(Q18=$Z$7,ROUND(Q$10*Q$9*Q$13*S18,2),0),0)","v":{"$error":"#REF!"}},{"$f":"IF(#REF!=\"X\",IF(H18=$AA$7,ROUND(H$10*H$9*H$13*J18,2),0)+IF(K18=$AA$7,ROUND(K$10*K$9*K$13*M18,2),0)+IF(N18=$AA$7,ROUND(N$10*N$9*N$13*P18,2),0)+IF(Q18=$AA$7,ROUND(Q$10*Q$9*Q$13*S18,2),0),0)","v":{"$error":"#REF!"}},{"$f":"IF(#REF!=\"X\",IF(H18=$AB$7,ROUND(H$10*H$9*H$13*J18,2),0)+IF(K18=$AB$7,ROUND(K$10*K$9*K$13*M18,2),0)+IF(N18=$AB$7,ROUND(N$10*N$9*N$13*P18,2),0)+IF(Q18=$AB$7,ROUND(Q$10*Q$9*Q$13*S18,2),0),0)","v":{"$error":"#REF!"}},{"$f":"IF(#REF!=\"X\",IF(H18=$AC$7,ROUND(H$10*H$9*H$13*J18,2),0)+IF(K18=$AC$7,ROUND(K$10*K$9*K$13*M18,2),0)+IF(N18=$AC$7,ROUND(N$10*N$9*N$13*P18,2),0)+IF(Q18=$AC$7,ROUND(Q$10*Q$9*Q$13*S18,2),0),0)","v":{"$error":"#REF!"}},{"$f":"IF(#REF!=\"X\",IF(H18=$AD$7,ROUND(H$10*H$9*H$13*J18,2),0)+IF(K18=$AD$7,ROUND(K$10*K$9*K$13*M18,2),0)+IF(N18=$AD$7,ROUND(N$10*N$9*N$13*P18,2),0)+IF(Q18=$AD$7,ROUND(Q$10*Q$9*Q$13*S18,2),0),0)","v":{"$error":"#REF!"}}]
[1,{"$nulls":4}," QbI.03  ","Piano economico e finanziario di massima (art.17, comma 4, d.P.R. 207/10 \u0081]art.164 D. lgs. 163/06 \u0081]art.1, comma 3, all.XXI)",{"$f":"IF(AND('Calcolo DM 140-12 + ORD. 108-20'!I32<9,'Calcolo DM 140-12 + ORD. 108-20'!I32>0),\"X\",\"\")","v":""},{"v":0,"d":"0.000"},{"v":0.03,"d":"0.030"},{"$f":"IF(AND('Calcolo DM 140-12 + ORD. 108-20'!L32<9,'Calcolo DM 140-12 + ORD. 108-20'!L32>0),\"X\",\"\")","v":""},{"v":0,"d":"0.000"},{"v":0.03,"d":"0.030"},{"$f":"IF(AND('Calcolo DM 140-12 + ORD. 108-20'!O32<9,'Calcolo DM 140-12 + ORD. 108-20'!O32>0),\"X\",\"\")","v":""},{"v":0,"d":"0.000"},{"v":0.03,"d":"0.030"},{"$f":"IF(AND('Calcolo DM 140-12 + ORD. 108-20'!R32<9,'Calcolo DM 140-12 + ORD. 108-20'!R32>0),\"X\",\"\")","v":""},{"v":0,"d":"0.000"},{"v":0.03,"d":"0.030"},{"$nulls":3},{"$f":"IF(#REF!=\"X\",IF(H19=$W$7,ROUND(H$10*H$9*H$13*J19,2),0)+IF(K19=$W$7,ROUND(K$10*K$9*K$13*M19,2),0)+IF(N19=$W$7,ROUND(N$10*N$9*N$13*P19,2),0)+IF(Q19=$W$7,ROUND(Q$10*Q$9*Q$13*S19,2),0),0)","v":{"$error":"#REF!"}},{"$f":"IF(#REF!=\"X\",IF(H19=$X$7,ROUND(H$10*H$9*H$13*J19,2),0)+IF(K19=$X$7,ROUND(K$10*K$9*K$13*M19,2),0)+IF(N19=$X$7,ROUND(N$10*N$9*N$13*P19,2),0)+IF(Q19=$X$7,ROUND(Q$10*Q$9*Q$13*S19,2),0),0)","v":{"$error":"#REF!"}},{"$f":"IF(#REF!=\"X\",IF(H19=$Y$7,ROUND(H$10*H$9*H$13*J19,2),0)+IF(K19=$Y$7,ROUND(K$10*K$9*K$13*M19,2),0)+IF(N19=$Y$7,ROUND(N$10*N$9*N$13*P19,2),0)+IF(Q19=$Y$7,ROUND(Q$10*Q$9*Q$13*S19,2),0),0)","v":{"$error":"#REF!"}},{"$f":"IF(#REF!=\"X\",IF(H19=$Z$7,ROUND(H$10*H$9*H$13*J19,2),0)+IF(K19=$Z$7,ROUND(K$10*K$9*K$13*M19,2),0)+IF(N19=$Z$7,ROUND(N$10*N$9*N$13*P19,2),0)+IF(Q19=$Z$7,ROUND(Q$10*Q$9*Q$13*S19,2),0),0)","v":{"$error":"#REF!"}},{"$f":"IF(#REF!=\"X\",IF(H19=$AA$7,ROUND(H$10*H$9*H$13*J19,2),0)+IF(K19=$AA$7,ROUND(K$10*K$9*K$13*M19,2),0)+IF(N19=$AA$7,ROUND(N$10*N$9*N$13*P19,2),0)+IF(Q19=$AA$7,ROUND(Q$10*Q$9*Q$13*S19,2),0),0)","v":{"$error":"#REF!"}},{"$f":"IF(#REF!=\"X\",IF(H19=$AB$7,ROUND(H$10*H$9*H$13*J19,2),0)+IF(K19=$AB$7,ROUND(K$10*K$9*K$13*M19,2),0)+IF(N19=$AB$7,ROUND(N$10*N$9*N$13*P19,2),0)+IF(Q19=$AB$7,ROUND(Q$10*Q$9*Q$13*S19,2),0),0)","v":{"$error":"#REF!"}},{"$f":"IF(#REF!=\"X\",IF(H19=$AC$7,ROUND(H$10*H$9*H$13*J19,2),0)+IF(K19=$AC$7,ROUND(K$10*K$9*K$13*M19,2),0)+IF(N19=$AC$7,ROUND(N$10*N$9*N$13*P19,2),0)+IF(Q19=$AC$7,ROUND(Q$10*Q$9*Q$13*S19,2),0),0)","v":{"$error":"#REF!"}},{"$f":"IF(#REF!=\"X\",IF(H19=$AD$7,ROUND(H$10*H$9*H$13*J19,2),0)+IF(K19=$AD$7,ROUND(K$10*K$9*K$13*M19,2),0)+IF(N19=$AD$7,ROUND(N$10*N$9*N$13*P19,2),0)+IF(Q19=$AD$7,ROUND(Q$10*Q$9*Q$13*S19,2),0),0)","v":{"$error":"#REF!"}}]
[1,{"$nulls":4}," QbI.04  ","Capitolato speciale descrittivo e prestazionale, schema di contratto (art.17, comma 3, lettere b), c), d.P.R. 207/10 \u0081]art.164, d.lgs. 163/06 \u0081]art.7, Allegato XXI)",{"$f":"IF(AND('Calcolo DM 140-12 + ORD. 108-20'!I33<9,'Calcolo DM 140-12 + ORD. 108-20'!I33>0),\"X\",\"\")","v":""},{"v":0,"d":"0.000"},{"v":0.07,"d":"0.070"},{"$f":"IF(AND('Calcolo DM 140-12 + ORD. 108-20'!L33<9,'Calcolo DM 140-12 + ORD. 108-20'!L33>0),\"X\",\"\")","v":""},{"v":0,"d":"0.000"},{"v":0.07,"d":"0.070"},{"$f":"IF(AND('Calcolo DM 140-12 + ORD. 108-20'!O33<9,'Calcolo DM 140-12 + ORD. 108-20'!O33>0),\"X\",\"\")","v":""},{"v":0,"d":"0.000"},{"v":0.07,"d":"0.070"},{"$f":"IF(AND('Calcolo DM 140-12 + ORD. 108-20'!R33<9,'Calcolo DM 140-12 + ORD. 108-20'!R33>0),\"X\",\"\")","v":""},{"v":0,"d":"0.000"},{"v":0.07,"d":"0.070"},{"$nulls":3},{"$f":"IF(#REF!=\"X\",IF(H20=$W$7,ROUND(H$10*H$9*H$13*J20,2),0)+IF(K20=$W$7,ROUND(K$10*K$9*K$13*M20,2),0)+IF(N20=$W$7,ROUND(N$10*N$9*N$13*P20,2),0)+IF(Q20=$W$7,ROUND(Q$10*Q$9*Q$13*S20,2),0),0)","v":{"$error":"#REF!"}},{"$f":"IF(#REF!=\"X\",IF(H20=$X$7,ROUND(H$10*H$9*H$13*J20,2),0)+IF(K20=$X$7,ROUND(K$10*K$9*K$13*M20,2),0)+IF(N20=$X$7,ROUND(N$10*N$9*N$13*P20,2),0)+IF(Q20=$X$7,ROUND(Q$10*Q$9*Q$13*S20,2),0),0)","v":{"$error":"#REF!"}},{"$f":"IF(#REF!=\"X\",IF(H20=$Y$7,ROUND(H$10*H$9*H$13*J20,2),0)+IF(K20=$Y$7,ROUND(K$10*K$9*K$13*M20,2),0)+IF(N20=$Y$7,ROUND(N$10*N$9*N$13*P20,2),0)+IF(Q20=$Y$7,ROUND(Q$10*Q$9*Q$13*S20,2),0),0)","v":{"$error":"#REF!"}},{"$f":"IF(#REF!=\"X\",IF(H20=$Z$7,ROUND(H$10*H$9*H$13*J20,2),0)+IF(K20=$Z$7,ROUND(K$10*K$9*K$13*M20,2),0)+IF(N20=$Z$7,ROUND(N$10*N$9*N$13*P20,2),0)+IF(Q20=$Z$7,ROUND(Q$10*Q$9*Q$13*S20,2),0),0)","v":{"$error":"#REF!"}},{"$f":"IF(#REF!=\"X\",IF(H20=$AA$7,ROUND(H$10*H$9*H$13*J20,2),0)+IF(K20=$AA$7,ROUND(K$10*K$9*K$13*M20,2),0)+IF(N20=$AA$7,ROUND(N$10*N$9*N$13*P20,2),0)+IF(Q20=$AA$7,ROUND(Q$10*Q$9*Q$13*S20,2),0),0)","v":{"$error":"#REF!"}},{"$f":"IF(#REF!=\"X\",IF(H20=$AB$7,ROUND(H$10*H$9*H$13*J20,2),0)+IF(K20=$AB$7,ROUND(K$10*K$9*K$13*M20,2),0)+IF(N20=$AB$7,ROUND(N$10*N$9*N$13*P20,2),0)+IF(Q20=$AB$7,ROUND(Q$10*Q$9*Q$13*S20,2),0),0)","v":{"$error":"#REF!"}},{"$f":"IF(#REF!=\"X\",IF(H20=$AC$7,ROUND(H$10*H$9*H$13*J20,2),0)+IF(K20=$AC$7,ROUND(K$10*K$9*K$13*M20,2),0)+IF(N20=$AC$7,ROUND(N$10*N$9*N$13*P20,2),0)+IF(Q20=$AC$7,ROUND(Q$10*Q$9*Q$13*S20,2),0),0)","v":{"$error":"#REF!"}},{"$f":"IF(#REF!=\"X\",IF(H20=$AD$7,ROUND(H$10*H$9*H$13*J20,2),0)+IF(K20=$AD$7,ROUND(K$10*K$9*K$13*M20,2),0)+IF(N20=$AD$7,ROUND(N$10*N$9*N$13*P20,2),0)+IF(Q20=$AD$7,ROUND(Q$10*Q$9*Q$13*S20,2),0),0)","v":{"$error":"#REF!"}}]
[1,{"$nulls":4}," QbI.05\nQps.02.01"," Relazione di indagine geotecnica (art.19, comma 1, d.P.R. 207/10)  ",{"$f":"IF(AND('Calcolo DM 140-12 + ORD. 108-20'!I34<9,'Calcolo DM 140-12 + ORD. 108-20'!I34>0),\"X\",\"\")","v":""},{"v":0,"d":"0.000"},{"v":0.03,"d":"0.030"},{"$f":"IF(AND('Calcolo DM 140-12 + ORD. 108-20'!L34<9,'Calcolo DM 140-12 + ORD. 108-20'!L34>0),\"X\",\"\")","v":""},{"v":0,"d":"0.000"},{"v":0.03,"d":"0.030"},{"$f":"IF(AND('Calcolo DM 140-12 + ORD. 108-20'!O34<9,'Calcolo DM 140-12 + ORD. 108-20'!O34>0),\"X\",\"\")","v":""},{"v":0,"d":"0.000"},{"v":0.03,"d":"0.030"},{"$f":"IF(AND('Calcolo DM 140-12 + ORD. 108-20'!R34<9,'Calcolo DM 140-12 + ORD. 108-20'!R34>0),\"X\",\"\")","v":""},{"v":0,"d":"0.000"},{"v":0.03,"d":"0.030"},{"$nulls":3},{"$f":"IF(#REF!=\"X\",IF(H21=$W$7,ROUND(H$10*H$9*H$13*J21,2),0)+IF(K21=$W$7,ROUND(K$10*K$9*K$13*M21,2),0)+IF(N21=$W$7,ROUND(N$10*N$9*N$13*P21,2),0)+IF(Q21=$W$7,ROUND(Q$10*Q$9*Q$13*S21,2),0),0)","v":{"$error":"#REF!"}},{"$f":"IF(#REF!=\"X\",IF(H21=$X$7,ROUND(H$10*H$9*H$13*J21,2),0)+IF(K21=$X$7,ROUND(K$10*K$9*K$13*M21,2),0)+IF(N21=$X$7,ROUND(N$10*N$9*N$13*P21,2),0)+IF(Q21=$X$7,ROUND(Q$10*Q$9*Q$13*S21,2),0),0)","v":{"$error":"#REF!"}},{"$f":"IF(#REF!=\"X\",IF(H21=$Y$7,ROUND(H$10*H$9*H$13*J21,2),0)+IF(K21=$Y$7,ROUND(K$10*K$9*K$13*M21,2),0)+IF(N21=$Y$7,ROUND(N$10*N$9*N$13*P21,2),0)+IF(Q21=$Y$7,ROUND(Q$10*Q$9*Q$13*S21,2),0),0)","v":{"$error":"#REF!"}},{"$f":"IF(#REF!=\"X\",IF(H21=$Z$7,ROUND(H$10*H$9*H$13*J21,2),0)+IF(K21=$Z$7,ROUND(K$10*K$9*K$13*M21,2),0)+IF(N21=$Z$7,ROUND(N$10*N$9*N$13*P21,2),0)+IF(Q21=$Z$7,ROUND(Q$10*Q$9*Q$13*S21,2),0),0)","v":{"$error":"#REF!"}},{"$f":"IF(#REF!=\"X\",IF(H21=$AA$7,ROUND(H$10*H$9*H$13*J21,2),0)+IF(K21=$AA$7,ROUND(K$10*K$9*K$13*M21,2),0)+IF(N21=$AA$7,ROUND(N$10*N$9*N$13*P21,2),0)+IF(Q21=$AA$7,ROUND(Q$10*Q$9*Q$13*S21,2),0),0)","v":{"$error":"#REF!"}},{"$f":"IF(#REF!=\"X\",IF(H21=$AB$7,ROUND(H$10*H$9*H$13*J21,2),0)+IF(K21=$AB$7,ROUND(K$10*K$9*K$13*M21,2),0)+IF(N21=$AB$7,ROUND(N$10*N$9*N$13*P21,2),0)+IF(Q21=$AB$7,ROUND(Q$10*Q$9*Q$13*S21,2),0),0)","v":{"$error":"#REF!"}},{"$f":"IF(#REF!=\"X\",IF(H21=$AC$7,ROUND(H$10*H$9*H$13*J21,2),0)+IF(K21=$AC$7,ROUND(K$10*K$9*K$13*M21,2),0)+IF(N21=$AC$7,ROUND(N$10*N$9*N$13*P21,2),0)+IF(Q21=$AC$7,ROUND(Q$10*Q$9*Q$13*S21,2),0),0)","v":{"$error":"#REF!"}},{"$f":"IF(#REF!=\"X\",IF(H21=$AD$7,ROUND(H$10*H$9*H$13*J21,2),0)+IF(K21=$AD$7,ROUND(K$10*K$9*K$13*M21,2),0)+IF(N21=$AD$7,ROUND(N$10*N$9*N$13*P21,2),0)+IF(Q21=$AD$7,ROUND(Q$10*Q$9*Q$13*S21,2),0),0)","v":{"$error":"#REF!"}},{"$nulls":3},"X","X","X"]
[1,{"$nulls":4}," QbI.06  "," Relazione di indagine idrologica (art.19, comma 1, d.P.R. 207/10)  ",{"$f":"IF(AND('Calcolo DM 140-12 + ORD. 108-20'!I35<9,'Calcolo DM 140-12 + ORD. 108-20'!I35>0),\"X\",\"\")","v":""},{"v":0,"d":"0.000"},0.015,{"$f":"IF(AND('Calcolo DM 140-12 + ORD. 108-20'!L35<9,'Calcolo DM 140-12 + ORD. 108-20'!L35>0),\"X\",\"\")","v":""},{"v":0,"d":"0.000"},0.015,{"$f":"IF(AND('Calcolo DM 140-12 + ORD. 108-20'!O35<9,'Calcolo DM 140-12 + ORD. 108-20'!O35>0),\"X\",\"\")","v":""},{"v":0,"d":"0.000"},0.015,{"$f":"IF(AND('Calcolo DM 140-12 + ORD. 108-20'!R35<9,'Calcolo DM 140-12 + ORD. 108-20'!R35>0),\"X\",\"\")","v":""},{"v":0,"d":"0.000"},0.015,{"$nulls":3},{"$f":"IF(#REF!=\"X\",IF(H22=$W$7,ROUND(H$10*H$9*H$13*J22,2),0)+IF(K22=$W$7,ROUND(K$10*K$9*K$13*M22,2),0)+IF(N22=$W$7,ROUND(N$10*N$9*N$13*P22,2),0)+IF(Q22=$W$7,ROUND(Q$10*Q$9*Q$13*S22,2),0),0)","v":{"$error":"#REF!"}},{"$f":"IF(#REF!=\"X\",IF(H22=$X$7,ROUND(H$10*H$9*H$13*J22,2),0)+IF(K22=$X$7,ROUND(K$10*K$9*K$13*M22,2),0)+IF(N22=$X$7,ROUND(N$10*N$9*N$13*P22,2),0)+IF(Q22=$X$7,ROUND(Q$10*Q$9*Q$13*S22,2),0),0)","v":{"$error":"#REF!"}},{"$f":"IF(#REF!=\"X\",IF(H22=$Y$7,ROUND(H$10*H$9*H$13*J22,2),0)+IF(K22=$Y$7,ROUND(K$10*K$9*K$13*M22,2),0)+IF(N22=$Y$7,ROUND(N$10*N$9*N$13*P22,2),0)+IF(Q22=$Y$7,ROUND(Q$10*Q$9*Q$13*S22,2),0),0)","v":{"$error":"#REF!"}},{"$f":"IF(#REF!=\"X\",IF(H22=$Z$7,ROUND(H$10*H$9*H$13*J22,2),0)+IF(K22=$Z$7,ROUND(K$10*K$9*K$13*M22,2),0)+IF(N22=$Z$7,ROUND(N$10*N$9*N$13*P22,2),0)+IF(Q22=$Z$7,ROUND(Q$10*Q$9*Q$13*S22,2),0),0)","v":{"$error":"#REF!"}},{"$f":"IF(#REF!=\"X\",IF(H22=$AA$7,ROUND(H$10*H$9*H$13*J22,2),0)+IF(K22=$AA$7,ROUND(K$10*K$9*K$13*M22,2),0)+IF(N22=$AA$7,ROUND(N$10*N$9*N$13*P22,2),0)+IF(Q22=$AA$7,ROUND(Q$10*Q$9*Q$13*S22,2),0),0)","v":{"$error":"#REF!"}},{"$f":"IF(#REF!=\"X\",IF(H22=$AB$7,ROUND(H$10*H$9*H$13*J22,2),0)+IF(K22=$AB$7,ROUND(K$10*K$9*K$13*M22,2),0)+IF(N22=$AB$7,ROUND(N$10*N$9*N$13*P22,2),0)+IF(Q22=$AB$7,ROUND(Q$10*Q$9*Q$13*S22,2),0),0)","v":{"$error":"#REF!"}},{"$f":"IF(#REF!=\"X\",IF(H22=$AC$7,ROUND(H$10*H$9*H$13*J22,2),0)+IF(K22=$AC$7,ROUND(K$10*K$9*K$13*M22,2),0)+IF(N22=$AC$7,ROUND(N$10*N$9*N$13*P22,2),0)+IF(Q22=$AC$7,ROUND(Q$10*Q$9*Q$13*S22,2),0),0)","v":{"$error":"#REF!"}},{"$f":"IF(#REF!=\"X\",IF(H22=$AD$7,ROUND(H$10*H$9*H$13*J22,2),0)+IF(K22=$AD$7,ROUND(K$10*K$9*K$13*M22,2),0)+IF(N22=$AD$7,ROUND(N$10*N$9*N$13*P22,2),0)+IF(Q22=$AD$7,ROUND(Q$10*Q$9*Q$13*S22,2),0),0)","v":{"$error":"#REF!"}}]
[1,{"$nulls":4}," QbI.07\nQps.04.01"," Relazione di indagine idraulica (art.19, comma 1, d.P.R. 207/10)  ",{"$f":"IF(AND('Calcolo DM 140-12 + ORD. 108-20'!I36<9,'Calcolo DM 140-12 + ORD. 108-20'!I36>0),\"X\",\"\")","v":""},{"v":0,"d":"0.000"},0.015,{"$f":"IF(AND('Calcolo DM 140-12 + ORD. 108-20'!L36<9,'Calcolo DM 140-12 + ORD. 108-20'!L36>0),\"X\",\"\")","v":""},{"v":0,"d":"0.000"},0.015,{"$f":"IF(AND('Calcolo DM 140-12 + ORD. 108-20'!O36<9,'Calcolo DM 140-12 + ORD. 108-20'!O36>0),\"X\",\"\")","v":""},{"v":0,"d":"0.000"},0.015,{"$f":"IF(AND('Calcolo DM 140-12 + ORD. 108-20'!R36<9,'Calcolo DM 140-12 + ORD. 108-20'!R36>0),\"X\",\"\")","v":""},{"v":0,"d":"0.000"},0.015,{"$nulls":3},{"$f":"IF(#REF!=\"X\",IF(H23=$W$7,ROUND(H$10*H$9*H$13*J23,2),0)+IF(K23=$W$7,ROUND(K$10*K$9*K$13*M23,2),0)+IF(N23=$W$7,ROUND(N$10*N$9*N$13*P23,2),0)+IF(Q23=$W$7,ROUND(Q$10*Q$9*Q$13*S23,2),0),0)","v":{"$error":"#REF!"}},{"$f":"IF(#REF!=\"X\",IF(H23=$X$7,ROUND(H$10*H$9*H$13*J23,2),0)+IF(K23=$X$7,ROUND(K$10*K$9*K$13*M23,2),0)+IF(N23=$X$7,ROUND(N$10*N$9*N$13*P23,2),0)+IF(Q23=$X$7,ROUND(Q$10*Q$9*Q$13*S23,2),0),0)","v":{"$error":"#REF!"}},{"$f":"IF(#REF!=\"X\",IF(H23=$Y$7,ROUND(H$10*H$9*H$13*J23,2),0)+IF(K23=$Y$7,ROUND(K$10*K$9*K$13*M23,2),0)+IF(N23=$Y$7,ROUND(N$10*N$9*N$13*P23,2),0)+IF(Q23=$Y$7,ROUND(Q$10*Q$9*Q$13*S23,2),0),0)","v":{"$error":"#REF!"}},{"$f":"IF(#REF!=\"X\",IF(H23=$Z$7,ROUND(H$10*H$9*H$13*J23,2),0)+IF(K23=$Z$7,ROUND(K$10*K$9*K$13*M23,2),0)+IF(N23=$Z$7,ROUND(N$10*N$9*N$13*P23,2),0)+IF(Q23=$Z$7,ROUND(Q$10*Q$9*Q$13*S23,2),0),0)","v":{"$error":"#REF!"}},{"$f":"IF(#REF!=\"X\",IF(H23=$AA$7,ROUND(H$10*H$9*H$13*J23,2),0)+IF(K23=$AA$7,ROUND(K$10*K$9*K$13*M23,2),0)+IF(N23=$AA$7,ROUND(N$10*N$9*N$13*P23,2),0)+IF(Q23=$AA$7,ROUND(Q$10*Q$9*Q$13*S23,2),0),0)","v":{"$error":"#REF!"}},{"$f":"IF(#REF!=\"X\",IF(H23=$AB$7,ROUND(H$10*H$9*H$13*J23,2),0)+IF(K23=$AB$7,ROUND(K$10*K$9*K$13*M23,2),0)+IF(N23=$AB$7,ROUND(N$10*N$9*N$13*P23,2),0)+IF(Q23=$AB$7,ROUND(Q$10*Q$9*Q$13*S23,2),0),0)","v":{"$error":"#REF!"}},{"$f":"IF(#REF!=\"X\",IF(H23=$AC$7,ROUND(H$10*H$9*H$13*J23,2),0)+IF(K23=$AC$7,ROUND(K$10*K$9*K$13*M23,2),0)+IF(N23=$AC$7,ROUND(N$10*N$9*N$13*P23,2),0)+IF(Q23=$AC$7,ROUND(Q$10*Q$9*Q$13*S23,2),0),0)","v":{"$error":"#REF!"}},{"$f":"IF(#REF!=\"X\",IF(H23=$AD$7,ROUND(H$10*H$9*H$13*J23,2),0)+IF(K23=$AD$7,ROUND(K$10*K$9*K$13*M23,2),0)+IF(N23=$AD$7,ROUND(N$10*N$9*N$13*P23,2),0)+IF(Q23=$AD$7,ROUND(Q$10*Q$9*Q$13*S23,2),0),0)","v":{"$error":"#REF!"}}]
[1,{"$nulls":4}," QbI.08\nQps.05.01"," Relazione di indagine sismica (art.19, comma 1, d.P.R. 207/10)  ",{"$f":"IF(AND('Calcolo DM 140-12 + ORD. 108-20'!I37<9,'Calcolo DM 140-12 + ORD. 108-20'!I37>0),\"X\",\"\")","v":""},{"v":0,"d":"0.000"},0.015,{"$f":"IF(AND('Calcolo DM 140-12 + ORD. 108-20'!L37<9,'Calcolo DM 140-12 + ORD. 108-20'!L37>0),\"X\",\"\")","v":""},{"v":0,"d":"0.000"},0.015,{"$f":"IF(AND('Calcolo DM 140-12 + ORD. 108-20'!O37<9,'Calcolo DM 140-12 + ORD. 108-20'!O37>0),\"X\",\"\")","v":""},{"v":0,"d":"0.000"},0.015,{"$f":"IF(AND('Calcolo DM 140-12 + ORD. 108-20'!R37<9,'Calcolo DM 140-12 + ORD. 108-20'!R37>0),\"X\",\"\")","v":""},{"v":0,"d":"0.000"},0.015,{"$nulls":3},{"$f":"IF(#REF!=\"X\",IF(H24=$W$7,ROUND(H$10*H$9*H$13*J24,2),0)+IF(K24=$W$7,ROUND(K$10*K$9*K$13*M24,2),0)+IF(N24=$W$7,ROUND(N$10*N$9*N$13*P24,2),0)+IF(Q24=$W$7,ROUND(Q$10*Q$9*Q$13*S24,2),0),0)","v":{"$error":"#REF!"}},{"$f":"IF(#REF!=\"X\",IF(H24=$X$7,ROUND(H$10*H$9*H$13*J24,2),0)+IF(K24=$X$7,ROUND(K$10*K$9*K$13*M24,2),0)+IF(N24=$X$7,ROUND(N$10*N$9*N$13*P24,2),0)+IF(Q24=$X$7,ROUND(Q$10*Q$9*Q$13*S24,2),0),0)","v":{"$error":"#REF!"}},{"$f":"IF(#REF!=\"X\",IF(H24=$Y$7,ROUND(H$10*H$9*H$13*J24,2),0)+IF(K24=$Y$7,ROUND(K$10*K$9*K$13*M24,2),0)+IF(N24=$Y$7,ROUND(N$10*N$9*N$13*P24,2),0)+IF(Q24=$Y$7,ROUND(Q$10*Q$9*Q$13*S24,2),0),0)","v":{"$error":"#REF!"}},{"$f":"IF(#REF!=\"X\",IF(H24=$Z$7,ROUND(H$10*H$9*H$13*J24,2),0)+IF(K24=$Z$7,ROUND(K$10*K$9*K$13*M24,2),0)+IF(N24=$Z$7,ROUND(N$10*N$9*N$13*P24,2),0)+IF(Q24=$Z$7,ROUND(Q$10*Q$9*Q$13*S24,2),0),0)","v":{"$error":"#REF!"}},{"$f":"IF(#REF!=\"X\",IF(H24=$AA$7,ROUND(H$10*H$9*H$13*J24,2),0)+IF(K24=$AA$7,ROUND(K$10*K$9*K$13*M24,2),0)+IF(N24=$AA$7,ROUND(N$10*N$9*N$13*P24,2),0)+IF(Q24=$AA$7,ROUND(Q$10*Q$9*Q$13*S24,2),0),0)","v":{"$error":"#REF!"}},{"$f":"IF(#REF!=\"X\",IF(H24=$AB$7,ROUND(H$10*H$9*H$13*J24,2),0)+IF(K24=$AB$7,ROUND(K$10*K$9*K$13*M24,2),0)+IF(N24=$AB$7,ROUND(N$10*N$9*N$13*P24,2),0)+IF(Q24=$AB$7,ROUND(Q$10*Q$9*Q$13*S24,2),0),0)","v":{"$error":"#REF!"}},{"$f":"IF(#REF!=\"X\",IF(H24=$AC$7,ROUND(H$10*H$9*H$13*J24,2),0)+IF(K24=$AC$7,ROUND(K$10*K$9*K$13*M24,2),0)+IF(N24=$AC$7,ROUND(N$10*N$9*N$13*P24,2),0)+IF(Q24=$AC$7,ROUND(Q$10*Q$9*Q$13*S24,2),0),0)","v":{"$error":"#REF!"}},{"$f":"IF(#REF!=\"X\",IF(H24=$AD$7,ROUND(H$10*H$9*H$13*J24,2),0)+IF(K24=$AD$7,ROUND(K$10*K$9*K$13*M24,2),0)+IF(N24=$AD$7,ROUND(N$10*N$9*N$13*P24,2),0)+IF(Q24=$AD$7,ROUND(Q$10*Q$9*Q$13*S24,2),0),0)","v":{"$error":"#REF!"}},{"$nulls":3},"X","X","X"]
[1,{"$nulls":4},"QbI.09  \nQps.09"," Relazione di indagine archeologica (art.19, comma 1, d.P.R. 207/10)  ",{"$f":"IF(AND('Calcolo DM 140-12 + ORD. 108-20'!I38<9,'Calcolo DM 140-12 + ORD. 108-20'!I38>0),\"X\",\"\")","v":""},{"v":0,"d":"0.000"},0.015,{"$f":"IF(AND('Calcolo DM 140-12 + ORD. 108-20'!L38<9,'Calcolo DM 140-12 + ORD. 108-20'!L38>0),\"X\",\"\")","v":""},{"v":0,"d":"0.000"},0.015,{"$f":"IF(AND('Calcolo DM 140-12 + ORD. 108-20'!O38<9,'Calcolo DM 140-12 + ORD. 108-20'!O38>0),\"X\",\"\")","v":""},{"v":0,"d":"0.000"},0.015,{"$f":"IF(AND('Calcolo DM 140-12 + ORD. 108-20'!R38<9,'Calcolo DM 140-12 + ORD. 108-20'!R38>0),\"X\",\"\")","v":""},{"v":0,"d":"0.000"},0.015,{"$nulls":3},{"$f":"IF(#REF!=\"X\",IF(H25=$W$7,ROUND(H$10*H$9*H$13*J25,2),0)+IF(K25=$W$7,ROUND(K$10*K$9*K$13*M25,2),0)+IF(N25=$W$7,ROUND(N$10*N$9*N$13*P25,2),0)+IF(Q25=$W$7,ROUND(Q$10*Q$9*Q$13*S25,2),0),0)","v":{"$error":"#REF!"}},{"$f":"IF(#REF!=\"X\",IF(H25=$X$7,ROUND(H$10*H$9*H$13*J25,2),0)+IF(K25=$X$7,ROUND(K$10*K$9*K$13*M25,2),0)+IF(N25=$X$7,ROUND(N$10*N$9*N$13*P25,2),0)+IF(Q25=$X$7,ROUND(Q$10*Q$9*Q$13*S25,2),0),0)","v":{"$error":"#REF!"}},{"$f":"IF(#REF!=\"X\",IF(H25=$Y$7,ROUND(H$10*H$9*H$13*J25,2),0)+IF(K25=$Y$7,ROUND(K$10*K$9*K$13*M25,2),0)+IF(N25=$Y$7,ROUND(N$10*N$9*N$13*P25,2),0)+IF(Q25=$Y$7,ROUND(Q$10*Q$9*Q$13*S25,2),0),0)","v":{"$error":"#REF!"}},{"$f":"IF(#REF!=\"X\",IF(H25=$Z$7,ROUND(H$10*H$9*H$13*J25,2),0)+IF(K25=$Z$7,ROUND(K$10*K$9*K$13*M25,2),0)+IF(N25=$Z$7,ROUND(N$10*N$9*N$13*P25,2),0)+IF(Q25=$Z$7,ROUND(Q$10*Q$9*Q$13*S25,2),0),0)","v":{"$error":"#REF!"}},{"$f":"IF(#REF!=\"X\",IF(H25=$AA$7,ROUND(H$10*H$9*H$13*J25,2),0)+IF(K25=$AA$7,ROUND(K$10*K$9*K$13*M25,2),0)+IF(N25=$AA$7,ROUND(N$10*N$9*N$13*P25,2),0)+IF(Q25=$AA$7,ROUND(Q$10*Q$9*Q$13*S25,2),0),0)","v":{"$error":"#REF!"}},{"$f":"IF(#REF!=\"X\",IF(H25=$AB$7,ROUND(H$10*H$9*H$13*J25,2),0)+IF(K25=$AB$7,ROUND(K$10*K$9*K$13*M25,2),0)+IF(N25=$AB$7,ROUND(N$10*N$9*N$13*P25,2),0)+IF(Q25=$AB$7,ROUND(Q$10*Q$9*Q$13*S25,2),0),0)","v":{"$error":"#REF!"}},{"$f":"IF(#REF!=\"X\",IF(H25=$AC$7,ROUND(H$10*H$9*H$13*J25,2),0)+IF(K25=$AC$7,ROUND(K$10*K$9*K$13*M25,2),0)+IF(N25=$AC$7,ROUND(N$10*N$9*N$13*P25,2),0)+IF(Q25=$AC$7,ROUND(Q$10*Q$9*Q$13*S25,2),0),0)","v":{"$error":"#REF!"}},{"$f":"IF(#REF!=\"X\",IF(H25=$AD$7,ROUND(H$10*H$9*H$13*J25,2),0)+IF(K25=$AD$7,ROUND(K$10*K$9*K$13*M25,2),0)+IF(N25=$AD$7,ROUND(N$10*N$9*N$13*P25,2),0)+IF(Q25=$AD$7,ROUND(Q$10*Q$9*Q$13*S25,2),0),0)","v":{"$error":"#REF!"}}]
[1,{"$nulls":4}," QbI.10\nQps.10.01"," Relazione di indagine geologica (art.19, comma 1, d.P.R. 207/10)  ",{"$f":"IF(AND('Calcolo DM 140-12 + ORD. 108-20'!I39<9,'Calcolo DM 140-12 + ORD. 108-20'!I39>0),\"X\",\"\")","v":""},{"v":0,"d":"0.000"},{"v":0.05,"d":"0.050"},{"$f":"IF(AND('Calcolo DM 140-12 + ORD. 108-20'!L39<9,'Calcolo DM 140-12 + ORD. 108-20'!L39>0),\"X\",\"\")","v":""},{"v":0,"d":"0.000"},{"v":0.05,"d":"0.050"},{"$f":"IF(AND('Calcolo DM 140-12 + ORD. 108-20'!O39<9,'Calcolo DM 140-12 + ORD. 108-20'!O39>0),\"X\",\"\")","v":""},{"v":0,"d":"0.000"},{"v":0.05,"d":"0.050"},{"$f":"IF(AND('Calcolo DM 140-12 + ORD. 108-20'!R39<9,'Calcolo DM 140-12 + ORD. 108-20'!R39>0),\"X\",\"\")","v":""},{"v":0,"d":"0.000"},{"v":0.05,"d":"0.050"},{"$nulls":3},{"$f":"IF(#REF!=\"X\",IF(H26=$W$7,ROUND(H$10*H$9*H$13*J26,2),0)+IF(K26=$W$7,ROUND(K$10*K$9*K$13*M26,2),0)+IF(N26=$W$7,ROUND(N$10*N$9*N$13*P26,2),0)+IF(Q26=$W$7,ROUND(Q$10*Q$9*Q$13*S26,2),0),0)","v":{"$error":"#REF!"}},{"$f":"IF(#REF!=\"X\",IF(H26=$X$7,ROUND(H$10*H$9*H$13*J26,2),0)+IF(K26=$X$7,ROUND(K$10*K$9*K$13*M26,2),0)+IF(N26=$X$7,ROUND(N$10*N$9*N$13*P26,2),0)+IF(Q26=$X$7,ROUND(Q$10*Q$9*Q$13*S26,2),0),0)","v":{"$error":"#REF!"}},{"$f":"IF(#REF!=\"X\",IF(H26=$Y$7,ROUND(H$10*H$9*H$13*J26,2),0)+IF(K26=$Y$7,ROUND(K$10*K$9*K$13*M26,2),0)+IF(N26=$Y$7,ROUND(N$10*N$9*N$13*P26,2),0)+IF(Q26=$Y$7,ROUND(Q$10*Q$9*Q$13*S26,2),0),0)","v":{"$error":"#REF!"}},{"$f":"IF(#REF!=\"X\",IF(H26=$Z$7,ROUND(H$10*H$9*H$13*J26,2),0)+IF(K26=$Z$7,ROUND(K$10*K$9*K$13*M26,2),0)+IF(N26=$Z$7,ROUND(N$10*N$9*N$13*P26,2),0)+IF(Q26=$Z$7,ROUND(Q$10*Q$9*Q$13*S26,2),0),0)","v":{"$error":"#REF!"}},{"$f":"IF(#REF!=\"X\",IF(H26=$AA$7,ROUND(H$10*H$9*H$13*J26,2),0)+IF(K26=$AA$7,ROUND(K$10*K$9*K$13*M26,2),0)+IF(N26=$AA$7,ROUND(N$10*N$9*N$13*P26,2),0)+IF(Q26=$AA$7,ROUND(Q$10*Q$9*Q$13*S26,2),0),0)","v":{"$error":"#REF!"}},{"$f":"IF(#REF!=\"X\",IF(H26=$AB$7,ROUND(H$10*H$9*H$13*J26,2),0)+IF(K26=$AB$7,ROUND(K$10*K$9*K$13*M26,2),0)+IF(N26=$AB$7,ROUND(N$10*N$9*N$13*P26,2),0)+IF(Q26=$AB$7,ROUND(Q$10*Q$9*Q$13*S26,2),0),0)","v":{"$error":"#REF!"}},{"$f":"IF(#REF!=\"X\",IF(H26=$AC$7,ROUND(H$10*H$9*H$13*J26,2),0)+IF(K26=$AC$7,ROUND(K$10*K$9*K$13*M26,2),0)+IF(N26=$AC$7,ROUND(N$10*N$9*N$13*P26,2),0)+IF(Q26=$AC$7,ROUND(Q$10*Q$9*Q$13*S26,2),0),0)","v":{"$error":"#REF!"}},{"$f":"IF(#REF!=\"X\",IF(H26=$AD$7,ROUND(H$10*H$9*H$13*J26,2),0)+IF(K26=$AD$7,ROUND(K$10*K$9*K$13*M26,2),0)+IF(N26=$AD$7,ROUND(N$10*N$9*N$13*P26,2),0)+IF(Q26=$AD$7,ROUND(Q$10*Q$9*Q$13*S26,2),0),0)","v":{"$error":"#REF!"}},{"$nulls":3},"X","X","X"]
[1,{"$nulls":4}," QbI.11  "," Progettazione integrale e coordinata \u0081- Integrazione delle prestazioni specialistiche (art.90, comma 7, d.lgs. 163/06) . Relazione tecno\u0081]alimentare  ",{"$f":"IF(AND('Calcolo DM 140-12 + ORD. 108-20'!I40<9,'Calcolo DM 140-12 + ORD. 108-20'!I40>0),\"X\",\"\")","v":""},{"v":0,"d":"0.000"},{"v":0.02,"d":"0.020"},{"$f":"IF(AND('Calcolo DM 140-12 + ORD. 108-20'!L40<9,'Calcolo DM 140-12 + ORD. 108-20'!L40>0),\"X\",\"\")","v":""},{"v":0,"d":"0.000"},{"v":0.02,"d":"0.020"},{"$f":"IF(AND('Calcolo DM 140-12 + ORD. 108-20'!O40<9,'Calcolo DM 140-12 + ORD. 108-20'!O40>0),\"X\",\"\")","v":""},{"v":0,"d":"0.000"},{"v":0.02,"d":"0.020"},{"$f":"IF(AND('Calcolo DM 140-12 + ORD. 108-20'!R40<9,'Calcolo DM 140-12 + ORD. 108-20'!R40>0),\"X\",\"\")","v":""},{"v":0,"d":"0.000"},{"v":0.02,"d":"0.020"},{"$nulls":3},{"$f":"IF(#REF!=\"X\",IF(H27=$W$7,ROUND(H$10*H$9*H$13*J27,2),0)+IF(K27=$W$7,ROUND(K$10*K$9*K$13*M27,2),0)+IF(N27=$W$7,ROUND(N$10*N$9*N$13*P27,2),0)+IF(Q27=$W$7,ROUND(Q$10*Q$9*Q$13*S27,2),0),0)","v":{"$error":"#REF!"}},{"$f":"IF(#REF!=\"X\",IF(H27=$X$7,ROUND(H$10*H$9*H$13*J27,2),0)+IF(K27=$X$7,ROUND(K$10*K$9*K$13*M27,2),0)+IF(N27=$X$7,ROUND(N$10*N$9*N$13*P27,2),0)+IF(Q27=$X$7,ROUND(Q$10*Q$9*Q$13*S27,2),0),0)","v":{"$error":"#REF!"}},{"$f":"IF(#REF!=\"X\",IF(H27=$Y$7,ROUND(H$10*H$9*H$13*J27,2),0)+IF(K27=$Y$7,ROUND(K$10*K$9*K$13*M27,2),0)+IF(N27=$Y$7,ROUND(N$10*N$9*N$13*P27,2),0)+IF(Q27=$Y$7,ROUND(Q$10*Q$9*Q$13*S27,2),0),0)","v":{"$error":"#REF!"}},{"$f":"IF(#REF!=\"X\",IF(H27=$Z$7,ROUND(H$10*H$9*H$13*J27,2),0)+IF(K27=$Z$7,ROUND(K$10*K$9*K$13*M27,2),0)+IF(N27=$Z$7,ROUND(N$10*N$9*N$13*P27,2),0)+IF(Q27=$Z$7,ROUND(Q$10*Q$9*Q$13*S27,2),0),0)","v":{"$error":"#REF!"}},{"$f":"IF(#REF!=\"X\",IF(H27=$AA$7,ROUND(H$10*H$9*H$13*J27,2),0)+IF(K27=$AA$7,ROUND(K$10*K$9*K$13*M27,2),0)+IF(N27=$AA$7,ROUND(N$10*N$9*N$13*P27,2),0)+IF(Q27=$AA$7,ROUND(Q$10*Q$9*Q$13*S27,2),0),0)","v":{"$error":"#REF!"}},{"$f":"IF(#REF!=\"X\",IF(H27=$AB$7,ROUND(H$10*H$9*H$13*J27,2),0)+IF(K27=$AB$7,ROUND(K$10*K$9*K$13*M27,2),0)+IF(N27=$AB$7,ROUND(N$10*N$9*N$13*P27,2),0)+IF(Q27=$AB$7,ROUND(Q$10*Q$9*Q$13*S27,2),0),0)","v":{"$error":"#REF!"}},{"$f":"IF(#REF!=\"X\",IF(H27=$AC$7,ROUND(H$10*H$9*H$13*J27,2),0)+IF(K27=$AC$7,ROUND(K$10*K$9*K$13*M27,2),0)+IF(N27=$AC$7,ROUND(N$10*N$9*N$13*P27,2),0)+IF(Q27=$AC$7,ROUND(Q$10*Q$9*Q$13*S27,2),0),0)","v":{"$error":"#REF!"}},{"$f":"IF(#REF!=\"X\",IF(H27=$AD$7,ROUND(H$10*H$9*H$13*J27,2),0)+IF(K27=$AD$7,ROUND(K$10*K$9*K$13*M27,2),0)+IF(N27=$AD$7,ROUND(N$10*N$9*N$13*P27,2),0)+IF(Q27=$AD$7,ROUND(Q$10*Q$9*Q$13*S27,2),0),0)","v":{"$error":"#REF!"}}]
[1,{"$nulls":4}," QbI.12  "," Studio di inserimento urbanistico (art.164, d.lgs. 163/06 \u0081]art.1, comma 2, lettera l), all.XXI6  ",{"$f":"IF(AND('Calcolo DM 140-12 + ORD. 108-20'!I41<9,'Calcolo DM 140-12 + ORD. 108-20'!I41>0),\"X\",\"\")","v":""},{"v":0,"d":"0.000"},{"v":0.03,"d":"0.030"},{"$f":"IF(AND('Calcolo DM 140-12 + ORD. 108-20'!L41<9,'Calcolo DM 140-12 + ORD. 108-20'!L41>0),\"X\",\"\")","v":""},{"v":0,"d":"0.000"},{"v":0.03,"d":"0.030"},{"$f":"IF(AND('Calcolo DM 140-12 + ORD. 108-20'!O41<9,'Calcolo DM 140-12 + ORD. 108-20'!O41>0),\"X\",\"\")","v":""},{"v":0,"d":"0.000"},{"v":0.01,"d":"0.010"},{"$f":"IF(AND('Calcolo DM 140-12 + ORD. 108-20'!R41<9,'Calcolo DM 140-12 + ORD. 108-20'!R41>0),\"X\",\"\")","v":""},{"v":0,"d":"0.000"},{"v":0.01,"d":"0.010"},{"$nulls":3},{"$f":"IF(#REF!=\"X\",IF(H28=$W$7,ROUND(H$10*H$9*H$13*J28,2),0)+IF(K28=$W$7,ROUND(K$10*K$9*K$13*M28,2),0)+IF(N28=$W$7,ROUND(N$10*N$9*N$13*P28,2),0)+IF(Q28=$W$7,ROUND(Q$10*Q$9*Q$13*S28,2),0),0)","v":{"$error":"#REF!"}},{"$f":"IF(#REF!=\"X\",IF(H28=$X$7,ROUND(H$10*H$9*H$13*J28,2),0)+IF(K28=$X$7,ROUND(K$10*K$9*K$13*M28,2),0)+IF(N28=$X$7,ROUND(N$10*N$9*N$13*P28,2),0)+IF(Q28=$X$7,ROUND(Q$10*Q$9*Q$13*S28,2),0),0)","v":{"$error":"#REF!"}},{"$f":"IF(#REF!=\"X\",IF(H28=$Y$7,ROUND(H$10*H$9*H$13*J28,2),0)+IF(K28=$Y$7,ROUND(K$10*K$9*K$13*M28,2),0)+IF(N28=$Y$7,ROUND(N$10*N$9*N$13*P28,2),0)+IF(Q28=$Y$7,ROUND(Q$10*Q$9*Q$13*S28,2),0),0)","v":{"$error":"#REF!"}},{"$f":"IF(#REF!=\"X\",IF(H28=$Z$7,ROUND(H$10*H$9*H$13*J28,2),0)+IF(K28=$Z$7,ROUND(K$10*K$9*K$13*M28,2),0)+IF(N28=$Z$7,ROUND(N$10*N$9*N$13*P28,2),0)+IF(Q28=$Z$7,ROUND(Q$10*Q$9*Q$13*S28,2),0),0)","v":{"$error":"#REF!"}},{"$f":"IF(#REF!=\"X\",IF(H28=$AA$7,ROUND(H$10*H$9*H$13*J28,2),0)+IF(K28=$AA$7,ROUND(K$10*K$9*K$13*M28,2),0)+IF(N28=$AA$7,ROUND(N$10*N$9*N$13*P28,2),0)+IF(Q28=$AA$7,ROUND(Q$10*Q$9*Q$13*S28,2),0),0)","v":{"$error":"#REF!"}},{"$f":"IF(#REF!=\"X\",IF(H28=$AB$7,ROUND(H$10*H$9*H$13*J28,2),0)+IF(K28=$AB$7,ROUND(K$10*K$9*K$13*M28,2),0)+IF(N28=$AB$7,ROUND(N$10*N$9*N$13*P28,2),0)+IF(Q28=$AB$7,ROUND(Q$10*Q$9*Q$13*S28,2),0),0)","v":{"$error":"#REF!"}},{"$f":"IF(#REF!=\"X\",IF(H28=$AC$7,ROUND(H$10*H$9*H$13*J28,2),0)+IF(K28=$AC$7,ROUND(K$10*K$9*K$13*M28,2),0)+IF(N28=$AC$7,ROUND(N$10*N$9*N$13*P28,2),0)+IF(Q28=$AC$7,ROUND(Q$10*Q$9*Q$13*S28,2),0),0)","v":{"$error":"#REF!"}},{"$f":"IF(#REF!=\"X\",IF(H28=$AD$7,ROUND(H$10*H$9*H$13*J28,2),0)+IF(K28=$AD$7,ROUND(K$10*K$9*K$13*M28,2),0)+IF(N28=$AD$7,ROUND(N$10*N$9*N$13*P28,2),0)+IF(Q28=$AD$7,ROUND(Q$10*Q$9*Q$13*S28,2),0),0)","v":{"$error":"#REF!"}}]
[1,{"$nulls":4},"QbI.13\nQps.01","Relazione tecnica sullo stato di consistenza degli   immobili da ristrutturare (art.17, comma 3, lettera a), d.P.R. 207/10) h  ",{"$f":"IF(AND('Calcolo DM 140-12 + ORD. 108-20'!I42<9,'Calcolo DM 140-12 + ORD. 108-20'!I42>0),\"X\",\"\")","v":""},{"v":0,"d":"0.000"},{"v":0.03,"d":"0.030"},{"$f":"IF(AND('Calcolo DM 140-12 + ORD. 108-20'!L42<9,'Calcolo DM 140-12 + ORD. 108-20'!L42>0),\"X\",\"\")","v":""},{"v":0,"d":"0.000"},{"v":0.03,"d":"0.030"},{"$f":"IF(AND('Calcolo DM 140-12 + ORD. 108-20'!O42<9,'Calcolo DM 140-12 + ORD. 108-20'!O42>0),\"X\",\"\")","v":""},{"v":0,"d":"0.000"},{"v":0.03,"d":"0.030"},{"$f":"IF(AND('Calcolo DM 140-12 + ORD. 108-20'!R42<9,'Calcolo DM 140-12 + ORD. 108-20'!R42>0),\"X\",\"\")","v":""},{"v":0,"d":"0.000"},{"v":0.03,"d":"0.030"},{"$nulls":3},{"$f":"IF(#REF!=\"X\",IF(H29=$W$7,ROUND(H$10*H$9*H$13*J29,2),0)+IF(K29=$W$7,ROUND(K$10*K$9*K$13*M29,2),0)+IF(N29=$W$7,ROUND(N$10*N$9*N$13*P29,2),0)+IF(Q29=$W$7,ROUND(Q$10*Q$9*Q$13*S29,2),0),0)","v":{"$error":"#REF!"}},{"$f":"IF(#REF!=\"X\",IF(H29=$X$7,ROUND(H$10*H$9*H$13*J29,2),0)+IF(K29=$X$7,ROUND(K$10*K$9*K$13*M29,2),0)+IF(N29=$X$7,ROUND(N$10*N$9*N$13*P29,2),0)+IF(Q29=$X$7,ROUND(Q$10*Q$9*Q$13*S29,2),0),0)","v":{"$error":"#REF!"}},{"$f":"IF(#REF!=\"X\",IF(H29=$Y$7,ROUND(H$10*H$9*H$13*J29,2),0)+IF(K29=$Y$7,ROUND(K$10*K$9*K$13*M29,2),0)+IF(N29=$Y$7,ROUND(N$10*N$9*N$13*P29,2),0)+IF(Q29=$Y$7,ROUND(Q$10*Q$9*Q$13*S29,2),0),0)","v":{"$error":"#REF!"}},{"$f":"IF(#REF!=\"X\",IF(H29=$Z$7,ROUND(H$10*H$9*H$13*J29,2),0)+IF(K29=$Z$7,ROUND(K$10*K$9*K$13*M29,2),0)+IF(N29=$Z$7,ROUND(N$10*N$9*N$13*P29,2),0)+IF(Q29=$Z$7,ROUND(Q$10*Q$9*Q$13*S29,2),0),0)","v":{"$error":"#REF!"}},{"$f":"IF(#REF!=\"X\",IF(H29=$AA$7,ROUND(H$10*H$9*H$13*J29,2),0)+IF(K29=$AA$7,ROUND(K$10*K$9*K$13*M29,2),0)+IF(N29=$AA$7,ROUND(N$10*N$9*N$13*P29,2),0)+IF(Q29=$AA$7,ROUND(Q$10*Q$9*Q$13*S29,2),0),0)","v":{"$error":"#REF!"}},{"$f":"IF(#REF!=\"X\",IF(H29=$AB$7,ROUND(H$10*H$9*H$13*J29,2),0)+IF(K29=$AB$7,ROUND(K$10*K$9*K$13*M29,2),0)+IF(N29=$AB$7,ROUND(N$10*N$9*N$13*P29,2),0)+IF(Q29=$AB$7,ROUND(Q$10*Q$9*Q$13*S29,2),0),0)","v":{"$error":"#REF!"}},{"$f":"IF(#REF!=\"X\",IF(H29=$AC$7,ROUND(H$10*H$9*H$13*J29,2),0)+IF(K29=$AC$7,ROUND(K$10*K$9*K$13*M29,2),0)+IF(N29=$AC$7,ROUND(N$10*N$9*N$13*P29,2),0)+IF(Q29=$AC$7,ROUND(Q$10*Q$9*Q$13*S29,2),0),0)","v":{"$error":"#REF!"}},{"$f":"IF(#REF!=\"X\",IF(H29=$AD$7,ROUND(H$10*H$9*H$13*J29,2),0)+IF(K29=$AD$7,ROUND(K$10*K$9*K$13*M29,2),0)+IF(N29=$AD$7,ROUND(N$10*N$9*N$13*P29,2),0)+IF(Q29=$AD$7,ROUND(Q$10*Q$9*Q$13*S29,2),0),0)","v":{"$error":"#REF!"}},{"$nulls":3},"X","X","X","X"]
[1,{"$nulls":4},"QbI.14\nQps.11.01"," Prime indicazioni di progettazione antincendio (d.m. 6/02/1982)  ",{"$f":"IF(AND('Calcolo DM 140-12 + ORD. 108-20'!I43<9,'Calcolo DM 140-12 + ORD. 108-20'!I43>0),\"X\",\"\")","v":""},{"v":0,"d":"0.000"},0.005,{"$f":"IF(AND('Calcolo DM 140-12 + ORD. 108-20'!L43<9,'Calcolo DM 140-12 + ORD. 108-20'!L43>0),\"X\",\"\")","v":""},{"v":0,"d":"0.000"},0.005,{"$f":"IF(AND('Calcolo DM 140-12 + ORD. 108-20'!O43<9,'Calcolo DM 140-12 + ORD. 108-20'!O43>0),\"X\",\"\")","v":""},{"v":0,"d":"0.000"},0.005,{"$f":"IF(AND('Calcolo DM 140-12 + ORD. 108-20'!R43<9,'Calcolo DM 140-12 + ORD. 108-20'!R43>0),\"X\",\"\")","v":""},{"v":0,"d":"0.000"},0.005,{"$nulls":3},{"$f":"IF(#REF!=\"X\",IF(H30=$W$7,ROUND(H$10*H$9*H$13*J30,2),0)+IF(K30=$W$7,ROUND(K$10*K$9*K$13*M30,2),0)+IF(N30=$W$7,ROUND(N$10*N$9*N$13*P30,2),0)+IF(Q30=$W$7,ROUND(Q$10*Q$9*Q$13*S30,2),0),0)","v":{"$error":"#REF!"}},{"$f":"IF(#REF!=\"X\",IF(H30=$X$7,ROUND(H$10*H$9*H$13*J30,2),0)+IF(K30=$X$7,ROUND(K$10*K$9*K$13*M30,2),0)+IF(N30=$X$7,ROUND(N$10*N$9*N$13*P30,2),0)+IF(Q30=$X$7,ROUND(Q$10*Q$9*Q$13*S30,2),0),0)","v":{"$error":"#REF!"}},{"$f":"IF(#REF!=\"X\",IF(H30=$Y$7,ROUND(H$10*H$9*H$13*J30,2),0)+IF(K30=$Y$7,ROUND(K$10*K$9*K$13*M30,2),0)+IF(N30=$Y$7,ROUND(N$10*N$9*N$13*P30,2),0)+IF(Q30=$Y$7,ROUND(Q$10*Q$9*Q$13*S30,2),0),0)","v":{"$error":"#REF!"}},{"$f":"IF(#REF!=\"X\",IF(H30=$Z$7,ROUND(H$10*H$9*H$13*J30,2),0)+IF(K30=$Z$7,ROUND(K$10*K$9*K$13*M30,2),0)+IF(N30=$Z$7,ROUND(N$10*N$9*N$13*P30,2),0)+IF(Q30=$Z$7,ROUND(Q$10*Q$9*Q$13*S30,2),0),0)","v":{"$error":"#REF!"}},{"$f":"IF(#REF!=\"X\",IF(H30=$AA$7,ROUND(H$10*H$9*H$13*J30,2),0)+IF(K30=$AA$7,ROUND(K$10*K$9*K$13*M30,2),0)+IF(N30=$AA$7,ROUND(N$10*N$9*N$13*P30,2),0)+IF(Q30=$AA$7,ROUND(Q$10*Q$9*Q$13*S30,2),0),0)","v":{"$error":"#REF!"}},{"$f":"IF(#REF!=\"X\",IF(H30=$AB$7,ROUND(H$10*H$9*H$13*J30,2),0)+IF(K30=$AB$7,ROUND(K$10*K$9*K$13*M30,2),0)+IF(N30=$AB$7,ROUND(N$10*N$9*N$13*P30,2),0)+IF(Q30=$AB$7,ROUND(Q$10*Q$9*Q$13*S30,2),0),0)","v":{"$error":"#REF!"}},{"$f":"IF(#REF!=\"X\",IF(H30=$AC$7,ROUND(H$10*H$9*H$13*J30,2),0)+IF(K30=$AC$7,ROUND(K$10*K$9*K$13*M30,2),0)+IF(N30=$AC$7,ROUND(N$10*N$9*N$13*P30,2),0)+IF(Q30=$AC$7,ROUND(Q$10*Q$9*Q$13*S30,2),0),0)","v":{"$error":"#REF!"}},{"$f":"IF(#REF!=\"X\",IF(H30=$AD$7,ROUND(H$10*H$9*H$13*J30,2),0)+IF(K30=$AD$7,ROUND(K$10*K$9*K$13*M30,2),0)+IF(N30=$AD$7,ROUND(N$10*N$9*N$13*P30,2),0)+IF(Q30=$AD$7,ROUND(Q$10*Q$9*Q$13*S30,2),0),0)","v":{"$error":"#REF!"}}]
[1,{"$nulls":4},"QbI.15\nQS.01.01"," Prime indicazioni e prescrizioni per la stesura dei Piani di Sicurezza  ",{"$f":"IF(AND('Calcolo DM 140-12 + ORD. 108-20'!I44<9,'Calcolo DM 140-12 + ORD. 108-20'!I44>0),\"X\",\"\")","v":""},{"v":0,"d":"0.000"},{"v":0.01,"d":"0.010"},{"$f":"IF(AND('Calcolo DM 140-12 + ORD. 108-20'!L44<9,'Calcolo DM 140-12 + ORD. 108-20'!L44>0),\"X\",\"\")","v":""},{"v":0,"d":"0.000"},{"v":0.01,"d":"0.010"},{"$f":"IF(AND('Calcolo DM 140-12 + ORD. 108-20'!O44<9,'Calcolo DM 140-12 + ORD. 108-20'!O44>0),\"X\",\"\")","v":""},{"v":0,"d":"0.000"},{"v":0.01,"d":"0.010"},{"$f":"IF(AND('Calcolo DM 140-12 + ORD. 108-20'!R44<9,'Calcolo DM 140-12 + ORD. 108-20'!R44>0),\"X\",\"\")","v":""},{"v":0,"d":"0.000"},{"v":0.01,"d":"0.010"},{"$nulls":3},{"$f":"IF(#REF!=\"X\",IF(H31=$W$7,ROUND(H$10*H$9*H$13*J31,2),0)+IF(K31=$W$7,ROUND(K$10*K$9*K$13*M31,2),0)+IF(N31=$W$7,ROUND(N$10*N$9*N$13*P31,2),0)+IF(Q31=$W$7,ROUND(Q$10*Q$9*Q$13*S31,2),0),0)","v":{"$error":"#REF!"}},{"$f":"IF(#REF!=\"X\",IF(H31=$X$7,ROUND(H$10*H$9*H$13*J31,2),0)+IF(K31=$X$7,ROUND(K$10*K$9*K$13*M31,2),0)+IF(N31=$X$7,ROUND(N$10*N$9*N$13*P31,2),0)+IF(Q31=$X$7,ROUND(Q$10*Q$9*Q$13*S31,2),0),0)","v":{"$error":"#REF!"}},{"$f":"IF(#REF!=\"X\",IF(H31=$Y$7,ROUND(H$10*H$9*H$13*J31,2),0)+IF(K31=$Y$7,ROUND(K$10*K$9*K$13*M31,2),0)+IF(N31=$Y$7,ROUND(N$10*N$9*N$13*P31,2),0)+IF(Q31=$Y$7,ROUND(Q$10*Q$9*Q$13*S31,2),0),0)","v":{"$error":"#REF!"}},{"$f":"IF(#REF!=\"X\",IF(H31=$Z$7,ROUND(H$10*H$9*H$13*J31,2),0)+IF(K31=$Z$7,ROUND(K$10*K$9*K$13*M31,2),0)+IF(N31=$Z$7,ROUND(N$10*N$9*N$13*P31,2),0)+IF(Q31=$Z$7,ROUND(Q$10*Q$9*Q$13*S31,2),0),0)","v":{"$error":"#REF!"}},{"$f":"IF(#REF!=\"X\",IF(H31=$AA$7,ROUND(H$10*H$9*H$13*J31,2),0)+IF(K31=$AA$7,ROUND(K$10*K$9*K$13*M31,2),0)+IF(N31=$AA$7,ROUND(N$10*N$9*N$13*P31,2),0)+IF(Q31=$AA$7,ROUND(Q$10*Q$9*Q$13*S31,2),0),0)","v":{"$error":"#REF!"}},{"$f":"IF(#REF!=\"X\",IF(H31=$AB$7,ROUND(H$10*H$9*H$13*J31,2),0)+IF(K31=$AB$7,ROUND(K$10*K$9*K$13*M31,2),0)+IF(N31=$AB$7,ROUND(N$10*N$9*N$13*P31,2),0)+IF(Q31=$AB$7,ROUND(Q$10*Q$9*Q$13*S31,2),0),0)","v":{"$error":"#REF!"}},{"$f":"IF(#REF!=\"X\",IF(H31=$AC$7,ROUND(H$10*H$9*H$13*J31,2),0)+IF(K31=$AC$7,ROUND(K$10*K$9*K$13*M31,2),0)+IF(N31=$AC$7,ROUND(N$10*N$9*N$13*P31,2),0)+IF(Q31=$AC$7,ROUND(Q$10*Q$9*Q$13*S31,2),0),0)","v":{"$error":"#REF!"}},{"$f":"IF(#REF!=\"X\",IF(H31=$AD$7,ROUND(H$10*H$9*H$13*J31,2),0)+IF(K31=$AD$7,ROUND(K$10*K$9*K$13*M31,2),0)+IF(N31=$AD$7,ROUND(N$10*N$9*N$13*P31,2),0)+IF(Q31=$AD$7,ROUND(Q$10*Q$9*Q$13*S31,2),0),0)","v":{"$error":"#REF!"}},{"$nulls":3},"X","X","X","X"]
[1,{"$nulls":4}," QbI.16  "," Studi di prefattibilita ambientale/Sicurezza alimentare  ",{"$f":"IF(AND('Calcolo DM 140-12 + ORD. 108-20'!I45<9,'Calcolo DM 140-12 + ORD. 108-20'!I45>0),\"X\",\"\")","v":""},{"v":0,"d":"0.000"},{"v":0.06,"d":"0.060"},{"$f":"IF(AND('Calcolo DM 140-12 + ORD. 108-20'!L45<9,'Calcolo DM 140-12 + ORD. 108-20'!L45>0),\"X\",\"\")","v":""},{"v":0,"d":"0.000"},{"v":0.06,"d":"0.060"},{"$f":"IF(AND('Calcolo DM 140-12 + ORD. 108-20'!O45<9,'Calcolo DM 140-12 + ORD. 108-20'!O45>0),\"X\",\"\")","v":""},{"v":0,"d":"0.000"},{"v":0.06,"d":"0.060"},{"$f":"IF(AND('Calcolo DM 140-12 + ORD. 108-20'!R45<9,'Calcolo DM 140-12 + ORD. 108-20'!R45>0),\"X\",\"\")","v":""},{"v":0,"d":"0.000"},{"v":0.06,"d":"0.060"},{"$nulls":3},{"$f":"IF(#REF!=\"X\",IF(H32=$W$7,ROUND(H$10*H$9*H$13*J32,2),0)+IF(K32=$W$7,ROUND(K$10*K$9*K$13*M32,2),0)+IF(N32=$W$7,ROUND(N$10*N$9*N$13*P32,2),0)+IF(Q32=$W$7,ROUND(Q$10*Q$9*Q$13*S32,2),0),0)","v":{"$error":"#REF!"}},{"$f":"IF(#REF!=\"X\",IF(H32=$X$7,ROUND(H$10*H$9*H$13*J32,2),0)+IF(K32=$X$7,ROUND(K$10*K$9*K$13*M32,2),0)+IF(N32=$X$7,ROUND(N$10*N$9*N$13*P32,2),0)+IF(Q32=$X$7,ROUND(Q$10*Q$9*Q$13*S32,2),0),0)","v":{"$error":"#REF!"}},{"$f":"IF(#REF!=\"X\",IF(H32=$Y$7,ROUND(H$10*H$9*H$13*J32,2),0)+IF(K32=$Y$7,ROUND(K$10*K$9*K$13*M32,2),0)+IF(N32=$Y$7,ROUND(N$10*N$9*N$13*P32,2),0)+IF(Q32=$Y$7,ROUND(Q$10*Q$9*Q$13*S32,2),0),0)","v":{"$error":"#REF!"}},{"$f":"IF(#REF!=\"X\",IF(H32=$Z$7,ROUND(H$10*H$9*H$13*J32,2),0)+IF(K32=$Z$7,ROUND(K$10*K$9*K$13*M32,2),0)+IF(N32=$Z$7,ROUND(N$10*N$9*N$13*P32,2),0)+IF(Q32=$Z$7,ROUND(Q$10*Q$9*Q$13*S32,2),0),0)","v":{"$error":"#REF!"}},{"$f":"IF(#REF!=\"X\",IF(H32=$AA$7,ROUND(H$10*H$9*H$13*J32,2),0)+IF(K32=$AA$7,ROUND(K$10*K$9*K$13*M32,2),0)+IF(N32=$AA$7,ROUND(N$10*N$9*N$13*P32,2),0)+IF(Q32=$AA$7,ROUND(Q$10*Q$9*Q$13*S32,2),0),0)","v":{"$error":"#REF!"}},{"$f":"IF(#REF!=\"X\",IF(H32=$AB$7,ROUND(H$10*H$9*H$13*J32,2),0)+IF(K32=$AB$7,ROUND(K$10*K$9*K$13*M32,2),0)+IF(N32=$AB$7,ROUND(N$10*N$9*N$13*P32,2),0)+IF(Q32=$AB$7,ROUND(Q$10*Q$9*Q$13*S32,2),0),0)","v":{"$error":"#REF!"}},{"$f":"IF(#REF!=\"X\",IF(H32=$AC$7,ROUND(H$10*H$9*H$13*J32,2),0)+IF(K32=$AC$7,ROUND(K$10*K$9*K$13*M32,2),0)+IF(N32=$AC$7,ROUND(N$10*N$9*N$13*P32,2),0)+IF(Q32=$AC$7,ROUND(Q$10*Q$9*Q$13*S32,2),0),0)","v":{"$error":"#REF!"}},{"$f":"IF(#REF!=\"X\",IF(H32=$AD$7,ROUND(H$10*H$9*H$13*J32,2),0)+IF(K32=$AD$7,ROUND(K$10*K$9*K$13*M32,2),0)+IF(N32=$AD$7,ROUND(N$10*N$9*N$13*P32,2),0)+IF(Q32=$AD$7,ROUND(Q$10*Q$9*Q$13*S32,2),0),0)","v":{"$error":"#REF!"}}]
[{"$f":"IF(OR(J33<>0,M33<>0,P33<>0,S33<>0),\"\",1)","v":1},"totale incidenze",{"$nulls":3},"∑ Q i",null,null,{"$f":"SUM(I17:I32)","v":{"v":0,"d":"0.000"}},{"$f":"I33","v":{"v":0,"d":"0.000"}},null,{"$f":"SUM(L17:L32)","v":{"v":0,"d":"0.000"}},{"$f":"L33","v":{"v":0,"d":"0.000"}},null,{"$f":"SUM(O17:O32)","v":{"v":0,"d":"0.000"}},{"$f":"O33","v":{"v":0,"d":"0.000"}},null,{"$f":"SUM(R17:R32)","v":{"v":0,"d":"0.000"}},{"$f":"R33","v":{"v":0,"d":"0.000"}},{"$nulls":12},{"$f":"H35-SUM(W17:AD32)","v":{"$error":"#REF!"}}]
[{"$f":"IF(OR(H34<>0,K34<>0,N34<>0,Q34<>0),\"\",1)","v":1},"Compenso al netto di spese ed oneri CNPAIA",{"$nulls":3},"V*P*G*ΣQ",null,{"$f":"J33*H13*H10*H9","v":{"v":0,"d":"0.00 €"}},null,null,{"$f":"M33*K13*K10*K9","v":{"v":0,"d":"0.00 €"}},null,null,{"$f":"P33*N13*N10*N9","v":{"v":0,"d":"0.00 €"}},null,null,{"$f":"S33*Q13*Q10*Q9","v":{"v":0,"d":"0.00 €"}},{"$nulls":3},"eventuale aggiustamento\ndx-sx",null,{"$f":"AF33","v":{"$error":"#REF!"}}]
[null,"COMPENSO AL NETTO DELLE SPESE",{"$nulls":5},{"$f":"ROUND(SUM(H34:S34),2)","v":{"v":0,"d":"0.00 €"}},{"$nulls":12},{"$f":"IF(H35=SUM(W35:AD35),\"OK\",\"CONTROLLA\")","v":{"$error":"#REF!"}},{"$f":"SUM(W35:AD35)-H35","v":{"$error":"#REF!"}},{"$f":"SUM(W17:W34)","v":{"$error":"#REF!"}},{"$error":"#REF!"},{"$error":"#REF!"},{"$error":"#REF!"},{"$error":"#REF!"},{"$error":"#REF!"},{"$error":"#REF!"},{"$error":"#REF!"}]
[]
[null,"PROGETTAZIONE DEFINITIVA",{"$nulls":5},"Edilizia",null,null,"Strutture",null,null,"Impianto Elettrico",null,null,"Impianto Termo-Idrau",{"$nulls":5},"PROGETTAZIONE DEFINITIVA"]
[{"$f":"IF(OR(H38<>\"\",K38<>\"\",N38<>\"\",Q38<>\"\"),\"\",1)","v":1},"PROGETTAZIONE","b.II)\nPROGETTAZIONE DEFINITIVA","prestazioni affidate","incidenza Q"," QbII.01  "," Relazioni generale e tecniche, Elaborati grafici art.24, comma 2, lettere a), b), d), f), d.P.R. 207/10)  ",{"$f":"IF(AND('Calcolo DM 140-12 + ORD. 108-20'!I51<9,'Calcolo DM 140-12 + ORD. 108-20'!I51>0),\"X\",\"\")","v":""},{"$f":"IF(H38=\"X\",J38,0)","v":{"v":0,"d":"0.000"}},{"v":0.23,"d":"0.230"},{"$f":"IF(AND('Calcolo DM 140-12 + ORD. 108-20'!L51<9,'Calcolo DM 140-12 + ORD. 108-20'!L51>0),\"X\",\"\")","v":""},{"$f":"IF(K38=\"X\",M38,0)","v":{"v":0,"d":"0.000"}},{"v":0.18,"d":"0.180"},{"$f":"IF(AND('Calcolo DM 140-12 + ORD. 108-20'!O51<9,'Calcolo DM 140-12 + ORD. 108-20'!O51>0),\"X\",\"\")","v":""},{"$f":"IF(N38=\"X\",P38,0)","v":{"v":0,"d":"0.000"}},{"v":0.2,"d":"0.200"},{"$f":"IF(AND('Calcolo DM 140-12 + ORD. 108-20'!R51<9,'Calcolo DM 140-12 + ORD. 108-20'!R51>0),\"X\",\"\")","v":""},{"$f":"IF(Q38=\"X\",S38,0)","v":{"v":0,"d":"0.000"}},{"v":0.2,"d":"0.200"},{"$nulls":3},{"$f":"IF(#REF!=\"X\",IF(H38=$W$7,ROUND(H$10*H$9*H$13*J38,2),0)+IF(K38=$W$7,ROUND(K$10*K$9*K$13*M38,2),0)+IF(N38=$W$7,ROUND(N$10*N$9*N$13*P38,2),0)+IF(Q38=$W$7,ROUND(Q$10*Q$9*Q$13*S38,2),0),0)","v":{"$error":"#REF!"}},{"$f":"IF(#REF!=\"X\",IF(H38=$X$7,ROUND(H$10*H$9*H$13*J38,2),0)+IF(K38=$X$7,ROUND(K$10*K$9*K$13*M38,2),0)+IF(N38=$X$7,ROUND(N$10*N$9*N$13*P38,2),0)+IF(Q38=$X$7,ROUND(Q$10*Q$9*Q$13*S38,2),0),0)","v":{"$error":"#REF!"}},{"$f":"IF(#REF!=\"X\",IF(H38=$Y$7,ROUND(H$10*H$9*H$13*J38,2),0)+IF(K38=$Y$7,ROUND(K$10*K$9*K$13*M38,2),0)+IF(N38=$Y$7,ROUND(N$10*N$9*N$13*P38,2),0)+IF(Q38=$Y$7,ROUND(Q$10*Q$9*Q$13*S38,2),0),0)","v":{"$error":"#REF!"}},{"$f":"IF(#REF!=\"X\",IF(H38=$Z$7,ROUND(H$10*H$9*H$13*J38,2),0)+IF(K38=$Z$7,ROUND(K$10*K$9*K$13*M38,2),0)+IF(N38=$Z$7,ROUND(N$10*N$9*N$13*P38,2),0)+IF(Q38=$Z$7,ROUND(Q$10*Q$9*Q$13*S38,2),0),0)","v":{"$error":"#REF!"}},{"$f":"IF(#REF!=\"X\",IF(H38=$AA$7,ROUND(H$10*H$9*H$13*J38,2),0)+IF(K38=$AA$7,ROUND(K$10*K$9*K$13*M38,2),0)+IF(N38=$AA$7,ROUND(N$10*N$9*N$13*P38,2),0)+IF(Q38=$AA$7,ROUND(Q$10*Q$9*Q$13*S38,2),0),0)","v":{"$error":"#REF!"}},{"$f":"IF(#REF!=\"X\",IF(H38=$AB$7,ROUND(H$10*H$9*H$13*J38,2),0)+IF(K38=$AB$7,ROUND(K$10*K$9*K$13*M38,2),0)+IF(N38=$AB$7,ROUND(N$10*N$9*N$13*P38,2),0)+IF(Q38=$AB$7,ROUND(Q$10*Q$9*Q$13*S38,2),0),0)","v":{"$error":"#REF!"}},{"$f":"IF(#REF!=\"X\",IF(H38=$AC$7,ROUND(H$10*H$9*H$13*J38,2),0)+IF(K38=$AC$7,ROUND(K$10*K$9*K$13*M38,2),0)+IF(N38=$AC$7,ROUND(N$10*N$9*N$13*P38,2),0)+IF(Q38=$AC$7,ROUND(Q$10*Q$9*Q$13*S38,2),0),0)","v":{"$error":"#REF!"}},{"$f":"IF(#REF!=\"X\",IF(H38=$AD$7,ROUND(H$10*H$9*H$13*J38,2),0)+IF(K38=$AD$7,ROUND(K$10*K$9*K$13*M38,2),0)+IF(N38=$AD$7,ROUND(N$10*N$9*N$13*P38,2),0)+IF(Q38=$AD$7,ROUND(Q$10*Q$9*Q$13*S38,2),0),0)","v":{"$error":"#REF!"}}]
[1,{"$nulls":4},"QbII.02 \nQpe.04.01"," Disciplinare descrittivo e prestazionale (art.24, comma 2, lettera g), d.P.R. 207/10)  ",{"$f":"IF(AND('Calcolo DM 140-12 + ORD. 108-20'!I52<9,'Calcolo DM 140-12 + ORD. 108-20'!I52>0),\"X\",\"\")","v":""},{"v":0,"d":"0.000"},{"v":0.01,"d":"0.010"},{"$f":"IF(AND('Calcolo DM 140-12 + ORD. 108-20'!L52<9,'Calcolo DM 140-12 + ORD. 108-20'!L52>0),\"X\",\"\")","v":""},{"v":0,"d":"0.000"},{"v":0.01,"d":"0.010"},{"$f":"IF(AND('Calcolo DM 140-12 + ORD. 108-20'!O52<9,'Calcolo DM 140-12 + ORD. 108-20'!O52>0),\"X\",\"\")","v":""},{"v":0,"d":"0.000"},{"v":0.01,"d":"0.010"},{"$f":"IF(AND('Calcolo DM 140-12 + ORD. 108-20'!R52<9,'Calcolo DM 140-12 + ORD. 108-20'!R52>0),\"X\",\"\")","v":""},{"v":0,"d":"0.000"},{"v":0.01,"d":"0.010"},{"$nulls":3},{"$f":"IF(#REF!=\"X\",IF(H39=$W$7,ROUND(H$10*H$9*H$13*J39,2),0)+IF(K39=$W$7,ROUND(K$10*K$9*K$13*M39,2),0)+IF(N39=$W$7,ROUND(N$10*N$9*N$13*P39,2),0)+IF(Q39=$W$7,ROUND(Q$10*Q$9*Q$13*S39,2),0),0)","v":{"$error":"#REF!"}},{"$f":"IF(#REF!=\"X\",IF(H39=$X$7,ROUND(H$10*H$9*H$13*J39,2),0)+IF(K39=$X$7,ROUND(K$10*K$9*K$13*M39,2),0)+IF(N39=$X$7,ROUND(N$10*N$9*N$13*P39,2),0)+IF(Q39=$X$7,ROUND(Q$10*Q$9*Q$13*S39,2),0),0)","v":{"$error":"#REF!"}},{"$f":"IF(#REF!=\"X\",IF(H39=$Y$7,ROUND(H$10*H$9*H$13*J39,2),0)+IF(K39=$Y$7,ROUND(K$10*K$9*K$13*M39,2),0)+IF(N39=$Y$7,ROUND(N$10*N$9*N$13*P39,2),0)+IF(Q39=$Y$7,ROUND(Q$10*Q$9*Q$13*S39,2),0),0)","v":{"$error":"#REF!"}},{"$f":"IF(#REF!=\"X\",IF(H39=$Z$7,ROUND(H$10*H$9*H$13*J39,2),0)+IF(K39=$Z$7,ROUND(K$10*K$9*K$13*M39,2),0)+IF(N39=$Z$7,ROUND(N$10*N$9*N$13*P39,2),0)+IF(Q39=$Z$7,ROUND(Q$10*Q$9*Q$13*S39,2),0),0)","v":{"$error":"#REF!"}},{"$f":"IF(#REF!=\"X\",IF(H39=$AA$7,ROUND(H$10*H$9*H$13*J39,2),0)+IF(K39=$AA$7,ROUND(K$10*K$9*K$13*M39,2),0)+IF(N39=$AA$7,ROUND(N$10*N$9*N$13*P39,2),0)+IF(Q39=$AA$7,ROUND(Q$10*Q$9*Q$13*S39,2),0),0)","v":{"$error":"#REF!"}},{"$f":"IF(#REF!=\"X\",IF(H39=$AB$7,ROUND(H$10*H$9*H$13*J39,2),0)+IF(K39=$AB$7,ROUND(K$10*K$9*K$13*M39,2),0)+IF(N39=$AB$7,ROUND(N$10*N$9*N$13*P39,2),0)+IF(Q39=$AB$7,ROUND(Q$10*Q$9*Q$13*S39,2),0),0)","v":{"$error":"#REF!"}},{"$f":"IF(#REF!=\"X\",IF(H39=$AC$7,ROUND(H$10*H$9*H$13*J39,2),0)+IF(K39=$AC$7,ROUND(K$10*K$9*K$13*M39,2),0)+IF(N39=$AC$7,ROUND(N$10*N$9*N$13*P39,2),0)+IF(Q39=$AC$7,ROUND(Q$10*Q$9*Q$13*S39,2),0),0)","v":{"$error":"#REF!"}},{"$f":"IF(#REF!=\"X\",IF(H39=$AD$7,ROUND(H$10*H$9*H$13*J39,2),0)+IF(K39=$AD$7,ROUND(K$10*K$9*K$13*M39,2),0)+IF(N39=$AD$7,ROUND(N$10*N$9*N$13*P39,2),0)+IF(Q39=$AD$7,ROUND(Q$10*Q$9*Q$13*S39,2),0),0)","v":{"$error":"#REF!"}},{"$nulls":3},"X","X","X","X"]
[1,{"$nulls":4},"QbII.03\nQpa.02"," Elenco prezzi, Computo metrico estimativo, Quadro economico (art.24, comma 2, lettere l), m), o), d.P.R. 207/10)  ",{"$f":"IF(AND('Calcolo DM 140-12 + ORD. 108-20'!I53<9,'Calcolo DM 140-12 + ORD. 108-20'!I53>0),\"X\",\"\")","v":""},{"v":0,"d":"0.000"},{"v":0.07,"d":"0.070"},{"$f":"IF(AND('Calcolo DM 140-12 + ORD. 108-20'!L53<9,'Calcolo DM 140-12 + ORD. 108-20'!L53>0),\"X\",\"\")","v":""},{"v":0,"d":"0.000"},{"v":0.04,"d":"0.040"},{"$f":"IF(AND('Calcolo DM 140-12 + ORD. 108-20'!O53<9,'Calcolo DM 140-12 + ORD. 108-20'!O53>0),\"X\",\"\")","v":""},{"v":0,"d":"0.000"},{"v":0.07,"d":"0.070"},{"$f":"IF(AND('Calcolo DM 140-12 + ORD. 108-20'!R53<9,'Calcolo DM 140-12 + ORD. 108-20'!R53>0),\"X\",\"\")","v":""},{"v":0,"d":"0.000"},{"v":0.07,"d":"0.070"},{"$nulls":3},{"$f":"IF(#REF!=\"X\",IF(H40=$W$7,ROUND(H$10*H$9*H$13*J40,2),0)+IF(K40=$W$7,ROUND(K$10*K$9*K$13*M40,2),0)+IF(N40=$W$7,ROUND(N$10*N$9*N$13*P40,2),0)+IF(Q40=$W$7,ROUND(Q$10*Q$9*Q$13*S40,2),0),0)","v":{"$error":"#REF!"}},{"$f":"IF(#REF!=\"X\",IF(H40=$X$7,ROUND(H$10*H$9*H$13*J40,2),0)+IF(K40=$X$7,ROUND(K$10*K$9*K$13*M40,2),0)+IF(N40=$X$7,ROUND(N$10*N$9*N$13*P40,2),0)+IF(Q40=$X$7,ROUND(Q$10*Q$9*Q$13*S40,2),0),0)","v":{"$error":"#REF!"}},{"$f":"IF(#REF!=\"X\",IF(H40=$Y$7,ROUND(H$10*H$9*H$13*J40,2),0)+IF(K40=$Y$7,ROUND(K$10*K$9*K$13*M40,2),0)+IF(N40=$Y$7,ROUND(N$10*N$9*N$13*P40,2),0)+IF(Q40=$Y$7,ROUND(Q$10*Q$9*Q$13*S40,2),0),0)","v":{"$error":"#REF!"}},{"$f":"IF(#REF!=\"X\",IF(H40=$Z$7,ROUND(H$10*H$9*H$13*J40,2),0)+IF(K40=$Z$7,ROUND(K$10*K$9*K$13*M40,2),0)+IF(N40=$Z$7,ROUND(N$10*N$9*N$13*P40,2),0)+IF(Q40=$Z$7,ROUND(Q$10*Q$9*Q$13*S40,2),0),0)","v":{"$error":"#REF!"}},{"$f":"IF(#REF!=\"X\",IF(H40=$AA$7,ROUND(H$10*H$9*H$13*J40,2),0)+IF(K40=$AA$7,ROUND(K$10*K$9*K$13*M40,2),0)+IF(N40=$AA$7,ROUND(N$10*N$9*N$13*P40,2),0)+IF(Q40=$AA$7,ROUND(Q$10*Q$9*Q$13*S40,2),0),0)","v":{"$error":"#REF!"}},{"$f":"IF(#REF!=\"X\",IF(H40=$AB$7,ROUND(H$10*H$9*H$13*J40,2),0)+IF(K40=$AB$7,ROUND(K$10*K$9*K$13*M40,2),0)+IF(N40=$AB$7,ROUND(N$10*N$9*N$13*P40,2),0)+IF(Q40=$AB$7,ROUND(Q$10*Q$9*Q$13*S40,2),0),0)","v":{"$error":"#REF!"}},{"$f":"IF(#REF!=\"X\",IF(H40=$AC$7,ROUND(H$10*H$9*H$13*J40,2),0)+IF(K40=$AC$7,ROUND(K$10*K$9*K$13*M40,2),0)+IF(N40=$AC$7,ROUND(N$10*N$9*N$13*P40,2),0)+IF(Q40=$AC$7,ROUND(Q$10*Q$9*Q$13*S40,2),0),0)","v":{"$error":"#REF!"}},{"$f":"IF(#REF!=\"X\",IF(H40=$AD$7,ROUND(H$10*H$9*H$13*J40,2),0)+IF(K40=$AD$7,ROUND(K$10*K$9*K$13*M40,2),0)+IF(N40=$AD$7,ROUND(N$10*N$9*N$13*P40,2),0)+IF(Q40=$AD$7,ROUND(Q$10*Q$9*Q$13*S40,2),0),0)","v":{"$error":"#REF!"}},{"$nulls":3},"X","X","X","X"]
[1,{"$nulls":4},"QbII.04\nQps.12"," Studio di inserimento urbanistico (art.24, comma 2, lettera c), d.P.R. 207/2010)  ",{"$f":"IF(AND('Calcolo DM 140-12 + ORD. 108-20'!I54<9,'Calcolo DM 140-12 + ORD. 108-20'!I54>0),\"X\",\"\")","v":""},{"v":0,"d":"0.000"},{"v":0.03,"d":"0.030"},{"$f":"IF(AND('Calcolo DM 140-12 + ORD. 108-20'!L54<9,'Calcolo DM 140-12 + ORD. 108-20'!L54>0),\"X\",\"\")","v":""},{"v":0,"d":"0.000"},{"v":0.03,"d":"0.030"},{"$f":"IF(AND('Calcolo DM 140-12 + ORD. 108-20'!O54<9,'Calcolo DM 140-12 + ORD. 108-20'!O54>0),\"X\",\"\")","v":""},{"v":0,"d":"0.000"},{"v":0.01,"d":"0.010"},{"$f":"IF(AND('Calcolo DM 140-12 + ORD. 108-20'!R54<9,'Calcolo DM 140-12 + ORD. 108-20'!R54>0),\"X\",\"\")","v":""},{"v":0,"d":"0.000"},{"v":0.01,"d":"0.010"},{"$nulls":3},{"$f":"IF(#REF!=\"X\",IF(H41=$W$7,ROUND(H$10*H$9*H$13*J41,2),0)+IF(K41=$W$7,ROUND(K$10*K$9*K$13*M41,2),0)+IF(N41=$W$7,ROUND(N$10*N$9*N$13*P41,2),0)+IF(Q41=$W$7,ROUND(Q$10*Q$9*Q$13*S41,2),0),0)","v":{"$error":"#REF!"}},{"$f":"IF(#REF!=\"X\",IF(H41=$X$7,ROUND(H$10*H$9*H$13*J41,2),0)+IF(K41=$X$7,ROUND(K$10*K$9*K$13*M41,2),0)+IF(N41=$X$7,ROUND(N$10*N$9*N$13*P41,2),0)+IF(Q41=$X$7,ROUND(Q$10*Q$9*Q$13*S41,2),0),0)","v":{"$error":"#REF!"}},{"$f":"IF(#REF!=\"X\",IF(H41=$Y$7,ROUND(H$10*H$9*H$13*J41,2),0)+IF(K41=$Y$7,ROUND(K$10*K$9*K$13*M41,2),0)+IF(N41=$Y$7,ROUND(N$10*N$9*N$13*P41,2),0)+IF(Q41=$Y$7,ROUND(Q$10*Q$9*Q$13*S41,2),0),0)","v":{"$error":"#REF!"}},{"$f":"IF(#REF!=\"X\",IF(H41=$Z$7,ROUND(H$10*H$9*H$13*J41,2),0)+IF(K41=$Z$7,ROUND(K$10*K$9*K$13*M41,2),0)+IF(N41=$Z$7,ROUND(N$10*N$9*N$13*P41,2),0)+IF(Q41=$Z$7,ROUND(Q$10*Q$9*Q$13*S41,2),0),0)","v":{"$error":"#REF!"}},{"$f":"IF(#REF!=\"X\",IF(H41=$AA$7,ROUND(H$10*H$9*H$13*J41,2),0)+IF(K41=$AA$7,ROUND(K$10*K$9*K$13*M41,2),0)+IF(N41=$AA$7,ROUND(N$10*N$9*N$13*P41,2),0)+IF(Q41=$AA$7,ROUND(Q$10*Q$9*Q$13*S41,2),0),0)","v":{"$error":"#REF!"}},{"$f":"IF(#REF!=\"X\",IF(H41=$AB$7,ROUND(H$10*H$9*H$13*J41,2),0)+IF(K41=$AB$7,ROUND(K$10*K$9*K$13*M41,2),0)+IF(N41=$AB$7,ROUND(N$10*N$9*N$13*P41,2),0)+IF(Q41=$AB$7,ROUND(Q$10*Q$9*Q$13*S41,2),0),0)","v":{"$error":"#REF!"}},{"$f":"IF(#REF!=\"X\",IF(H41=$AC$7,ROUND(H$10*H$9*H$13*J41,2),0)+IF(K41=$AC$7,ROUND(K$10*K$9*K$13*M41,2),0)+IF(N41=$AC$7,ROUND(N$10*N$9*N$13*P41,2),0)+IF(Q41=$AC$7,ROUND(Q$10*Q$9*Q$13*S41,2),0),0)","v":{"$error":"#REF!"}},{"$f":"IF(#REF!=\"X\",IF(H41=$AD$7,ROUND(H$10*H$9*H$13*J41,2),0)+IF(K41=$AD$7,ROUND(K$10*K$9*K$13*M41,2),0)+IF(N41=$AD$7,ROUND(N$10*N$9*N$13*P41,2),0)+IF(Q41=$AD$7,ROUND(Q$10*Q$9*Q$13*S41,2),0),0)","v":{"$error":"#REF!"}}]
[1,{"$nulls":4}," QbII.05  "," Schema di contratto, Capitolato speciale d'appalto h  ",{"$f":"IF(AND('Calcolo DM 140-12 + ORD. 108-20'!I55<9,'Calcolo DM 140-12 + ORD. 108-20'!I55>0),\"X\",\"\")","v":""},{"v":0,"d":"0.000"},{"v":0.07,"d":"0.070"},{"$f":"IF(AND('Calcolo DM 140-12 + ORD. 108-20'!L55<9,'Calcolo DM 140-12 + ORD. 108-20'!L55>0),\"X\",\"\")","v":""},{"v":0,"d":"0.000"},{"v":0.07,"d":"0.070"},{"$f":"IF(AND('Calcolo DM 140-12 + ORD. 108-20'!O55<9,'Calcolo DM 140-12 + ORD. 108-20'!O55>0),\"X\",\"\")","v":""},{"v":0,"d":"0.000"},{"v":0.08,"d":"0.080"},{"$f":"IF(AND('Calcolo DM 140-12 + ORD. 108-20'!R55<9,'Calcolo DM 140-12 + ORD. 108-20'!R55>0),\"X\",\"\")","v":""},{"v":0,"d":"0.000"},{"v":0.08,"d":"0.080"},{"$nulls":3},{"$f":"IF(#REF!=\"X\",IF(H42=$W$7,ROUND(H$10*H$9*H$13*J42,2),0)+IF(K42=$W$7,ROUND(K$10*K$9*K$13*M42,2),0)+IF(N42=$W$7,ROUND(N$10*N$9*N$13*P42,2),0)+IF(Q42=$W$7,ROUND(Q$10*Q$9*Q$13*S42,2),0),0)","v":{"$error":"#REF!"}},{"$f":"IF(#REF!=\"X\",IF(H42=$X$7,ROUND(H$10*H$9*H$13*J42,2),0)+IF(K42=$X$7,ROUND(K$10*K$9*K$13*M42,2),0)+IF(N42=$X$7,ROUND(N$10*N$9*N$13*P42,2),0)+IF(Q42=$X$7,ROUND(Q$10*Q$9*Q$13*S42,2),0),0)","v":{"$error":"#REF!"}},{"$f":"IF(#REF!=\"X\",IF(H42=$Y$7,ROUND(H$10*H$9*H$13*J42,2),0)+IF(K42=$Y$7,ROUND(K$10*K$9*K$13*M42,2),0)+IF(N42=$Y$7,ROUND(N$10*N$9*N$13*P42,2),0)+IF(Q42=$Y$7,ROUND(Q$10*Q$9*Q$13*S42,2),0),0)","v":{"$error":"#REF!"}},{"$f":"IF(#REF!=\"X\",IF(H42=$Z$7,ROUND(H$10*H$9*H$13*J42,2),0)+IF(K42=$Z$7,ROUND(K$10*K$9*K$13*M42,2),0)+IF(N42=$Z$7,ROUND(N$10*N$9*N$13*P42,2),0)+IF(Q42=$Z$7,ROUND(Q$10*Q$9*Q$13*S42,2),0),0)","v":{"$error":"#REF!"}},{"$f":"IF(#REF!=\"X\",IF(H42=$AA$7,ROUND(H$10*H$9*H$13*J42,2),0)+IF(K42=$AA$7,ROUND(K$10*K$9*K$13*M42,2),0)+IF(N42=$AA$7,ROUND(N$10*N$9*N$13*P42,2),0)+IF(Q42=$AA$7,ROUND(Q$10*Q$9*Q$13*S42,2),0),0)","v":{"$error":"#REF!"}},{"$f":"IF(#REF!=\"X\",IF(H42=$AB$7,ROUND(H$10*H$9*H$13*J42,2),0)+IF(K42=$AB$7,ROUND(K$10*K$9*K$13*M42,2),0)+IF(N42=$AB$7,ROUND(N$10*N$9*N$13*P42,2),0)+IF(Q42=$AB$7,ROUND(Q$10*Q$9*Q$13*S42,2),0),0)","v":{"$error":"#REF!"}},{"$f":"IF(#REF!=\"X\",IF(H42=$AC$7,ROUND(H$10*H$9*H$13*J42,2),0)+IF(K42=$AC$7,ROUND(K$10*K$9*K$13*M42,2),0)+IF(N42=$AC$7,ROUND(N$10*N$9*N$13*P42,2),0)+IF(Q42=$AC$7,ROUND(Q$10*Q$9*Q$13*S42,2),0),0)","v":{"$error":"#REF!"}},{"$f":"IF(#REF!=\"X\",IF(H42=$AD$7,ROUND(H$10*H$9*H$13*J42,2),0)+IF(K42=$AD$7,ROUND(K$10*K$9*K$13*M42,2),0)+IF(N42=$AD$7,ROUND(N$10*N$9*N$13*P42,2),0)+IF(Q42=$AD$7,ROUND(Q$10*Q$9*Q$13*S42,2),0),0)","v":{"$error":"#REF!"}}]
[1,{"$nulls":4},"QbII.06\nQps.02.02"," Relazione di indagine geotecnica (art.26, comma 1, d.P.R. 207/2010)  ",{"$f":"IF(AND('Calcolo DM 140-12 + ORD. 108-20'!I56<9,'Calcolo DM 140-12 + ORD. 108-20'!I56>0),\"X\",\"\")","v":""},{"v":0,"d":"0.000"},{"v":0.09,"d":"0.090"},{"$f":"IF(AND('Calcolo DM 140-12 + ORD. 108-20'!L56<9,'Calcolo DM 140-12 + ORD. 108-20'!L56>0),\"X\",\"\")","v":""},{"v":0,"d":"0.000"},{"v":0.09,"d":"0.090"},{"$f":"IF(AND('Calcolo DM 140-12 + ORD. 108-20'!O56<9,'Calcolo DM 140-12 + ORD. 108-20'!O56>0),\"X\",\"\")","v":""},{"v":0,"d":"0.000"},{"v":0.09,"d":"0.090"},{"$f":"IF(AND('Calcolo DM 140-12 + ORD. 108-20'!R56<9,'Calcolo DM 140-12 + ORD. 108-20'!R56>0),\"X\",\"\")","v":""},{"v":0,"d":"0.000"},{"v":0.09,"d":"0.090"},{"$nulls":3},{"$f":"IF(#REF!=\"X\",IF(H43=$W$7,ROUND(H$10*H$9*H$13*J43,2),0)+IF(K43=$W$7,ROUND(K$10*K$9*K$13*M43,2),0)+IF(N43=$W$7,ROUND(N$10*N$9*N$13*P43,2),0)+IF(Q43=$W$7,ROUND(Q$10*Q$9*Q$13*S43,2),0),0)","v":{"$error":"#REF!"}},{"$f":"IF(#REF!=\"X\",IF(H43=$X$7,ROUND(H$10*H$9*H$13*J43,2),0)+IF(K43=$X$7,ROUND(K$10*K$9*K$13*M43,2),0)+IF(N43=$X$7,ROUND(N$10*N$9*N$13*P43,2),0)+IF(Q43=$X$7,ROUND(Q$10*Q$9*Q$13*S43,2),0),0)","v":{"$error":"#REF!"}},{"$f":"IF(#REF!=\"X\",IF(H43=$Y$7,ROUND(H$10*H$9*H$13*J43,2),0)+IF(K43=$Y$7,ROUND(K$10*K$9*K$13*M43,2),0)+IF(N43=$Y$7,ROUND(N$10*N$9*N$13*P43,2),0)+IF(Q43=$Y$7,ROUND(Q$10*Q$9*Q$13*S43,2),0),0)","v":{"$error":"#REF!"}},{"$f":"IF(#REF!=\"X\",IF(H43=$Z$7,ROUND(H$10*H$9*H$13*J43,2),0)+IF(K43=$Z$7,ROUND(K$10*K$9*K$13*M43,2),0)+IF(N43=$Z$7,ROUND(N$10*N$9*N$13*P43,2),0)+IF(Q43=$Z$7,ROUND(Q$10*Q$9*Q$13*S43,2),0),0)","v":{"$error":"#REF!"}},{"$f":"IF(#REF!=\"X\",IF(H43=$AA$7,ROUND(H$10*H$9*H$13*J43,2),0)+IF(K43=$AA$7,ROUND(K$10*K$9*K$13*M43,2),0)+IF(N43=$AA$7,ROUND(N$10*N$9*N$13*P43,2),0)+IF(Q43=$AA$7,ROUND(Q$10*Q$9*Q$13*S43,2),0),0)","v":{"$error":"#REF!"}},{"$f":"IF(#REF!=\"X\",IF(H43=$AB$7,ROUND(H$10*H$9*H$13*J43,2),0)+IF(K43=$AB$7,ROUND(K$10*K$9*K$13*M43,2),0)+IF(N43=$AB$7,ROUND(N$10*N$9*N$13*P43,2),0)+IF(Q43=$AB$7,ROUND(Q$10*Q$9*Q$13*S43,2),0),0)","v":{"$error":"#REF!"}},{"$f":"IF(#REF!=\"X\",IF(H43=$AC$7,ROUND(H$10*H$9*H$13*J43,2),0)+IF(K43=$AC$7,ROUND(K$10*K$9*K$13*M43,2),0)+IF(N43=$AC$7,ROUND(N$10*N$9*N$13*P43,2),0)+IF(Q43=$AC$7,ROUND(Q$10*Q$9*Q$13*S43,2),0),0)","v":{"$error":"#REF!"}},{"$f":"IF(#REF!=\"X\",IF(H43=$AD$7,ROUND(H$10*H$9*H$13*J43,2),0)+IF(K43=$AD$7,ROUND(K$10*K$9*K$13*M43,2),0)+IF(N43=$AD$7,ROUND(N$10*N$9*N$13*P43,2),0)+IF(Q43=$AD$7,ROUND(Q$10*Q$9*Q$13*S43,2),0),0)","v":{"$error":"#REF!"}},{"$nulls":3},"X","X","X"]
[1,{"$nulls":4}," QbII.07  "," Relazione di indagine idrologica (art.26, comma 1, d.P.R. 207/2010)  ",{"$f":"IF(AND('Calcolo DM 140-12 + ORD. 108-20'!I57<9,'Calcolo DM 140-12 + ORD. 108-20'!I57>0),\"X\",\"\")","v":""},{"v":0,"d":"0.000"},{"v":0.03,"d":"0.030"},{"$f":"IF(AND('Calcolo DM 140-12 + ORD. 108-20'!L57<9,'Calcolo DM 140-12 + ORD. 108-20'!L57>0),\"X\",\"\")","v":""},{"v":0,"d":"0.000"},{"v":0.03,"d":"0.030"},{"$f":"IF(AND('Calcolo DM 140-12 + ORD. 108-20'!O57<9,'Calcolo DM 140-12 + ORD. 108-20'!O57>0),\"X\",\"\")","v":""},{"v":0,"d":"0.000"},{"v":0.03,"d":"0.030"},{"$f":"IF(AND('Calcolo DM 140-12 + ORD. 108-20'!R57<9,'Calcolo DM 140-12 + ORD. 108-20'!R57>0),\"X\",\"\")","v":""},{"v":0,"d":"0.000"},{"v":0.03,"d":"0.030"},{"$nulls":3},{"$f":"IF(#REF!=\"X\",IF(H44=$W$7,ROUND(H$10*H$9*H$13*J44,2),0)+IF(K44=$W$7,ROUND(K$10*K$9*K$13*M44,2),0)+IF(N44=$W$7,ROUND(N$10*N$9*N$13*P44,2),0)+IF(Q44=$W$7,ROUND(Q$10*Q$9*Q$13*S44,2),0),0)","v":{"$error":"#REF!"}},{"$f":"IF(#REF!=\"X\",IF(H44=$X$7,ROUND(H$10*H$9*H$13*J44,2),0)+IF(K44=$X$7,ROUND(K$10*K$9*K$13*M44,2),0)+IF(N44=$X$7,ROUND(N$10*N$9*N$13*P44,2),0)+IF(Q44=$X$7,ROUND(Q$10*Q$9*Q$13*S44,2),0),0)","v":{"$error":"#REF!"}},{"$f":"IF(#REF!=\"X\",IF(H44=$Y$7,ROUND(H$10*H$9*H$13*J44,2),0)+IF(K44=$Y$7,ROUND(K$10*K$9*K$13*M44,2),0)+IF(N44=$Y$7,ROUND(N$10*N$9*N$13*P44,2),0)+IF(Q44=$Y$7,ROUND(Q$10*Q$9*Q$13*S44,2),0),0)","v":{"$error":"#REF!"}},{"$f":"IF(#REF!=\"X\",IF(H44=$Z$7,ROUND(H$10*H$9*H$13*J44,2),0)+IF(K44=$Z$7,ROUND(K$10*K$9*K$13*M44,2),0)+IF(N44=$Z$7,ROUND(N$10*N$9*N$13*P44,2),0)+IF(Q44=$Z$7,ROUND(Q$10*Q$9*Q$13*S44,2),0),0)","v":{"$error":"#REF!"}},{"$f":"IF(#REF!=\"X\",IF(H44=$AA$7,ROUND(H$10*H$9*H$13*J44,2),0)+IF(K44=$AA$7,ROUND(K$10*K$9*K$13*M44,2),0)+IF(N44=$AA$7,ROUND(N$10*N$9*N$13*P44,2),0)+IF(Q44=$AA$7,ROUND(Q$10*Q$9*Q$13*S44,2),0),0)","v":{"$error":"#REF!"}},{"$f":"IF(#REF!=\"X\",IF(H44=$AB$7,ROUND(H$10*H$9*H$13*J44,2),0)+IF(K44=$AB$7,ROUND(K$10*K$9*K$13*M44,2),0)+IF(N44=$AB$7,ROUND(N$10*N$9*N$13*P44,2),0)+IF(Q44=$AB$7,ROUND(Q$10*Q$9*Q$13*S44,2),0),0)","v":{"$error":"#REF!"}},{"$f":"IF(#REF!=\"X\",IF(H44=$AC$7,ROUND(H$10*H$9*H$13*J44,2),0)+IF(K44=$AC$7,ROUND(K$10*K$9*K$13*M44,2),0)+IF(N44=$AC$7,ROUND(N$10*N$9*N$13*P44,2),0)+IF(Q44=$AC$7,ROUND(Q$10*Q$9*Q$13*S44,2),0),0)","v":{"$error":"#REF!"}},{"$f":"IF(#REF!=\"X\",IF(H44=$AD$7,ROUND(H$10*H$9*H$13*J44,2),0)+IF(K44=$AD$7,ROUND(K$10*K$9*K$13*M44,2),0)+IF(N44=$AD$7,ROUND(N$10*N$9*N$13*P44,2),0)+IF(Q44=$AD$7,ROUND(Q$10*Q$9*Q$13*S44,2),0),0)","v":{"$error":"#REF!"}}]
[1,{"$nulls":4},"QbII.08\nQps.04.02"," Relazione di indagine idraulica (art.26, comma 1, d.P.R. 207/2010)  ",{"$f":"IF(AND('Calcolo DM 140-12 + ORD. 108-20'!I58<9,'Calcolo DM 140-12 + ORD. 108-20'!I58>0),\"X\",\"\")","v":""},{"v":0,"d":"0.000"},{"v":0.03,"d":"0.030"},{"$f":"IF(AND('Calcolo DM 140-12 + ORD. 108-20'!L58<9,'Calcolo DM 140-12 + ORD. 108-20'!L58>0),\"X\",\"\")","v":""},{"v":0,"d":"0.000"},{"v":0.03,"d":"0.030"},{"$f":"IF(AND('Calcolo DM 140-12 + ORD. 108-20'!O58<9,'Calcolo DM 140-12 + ORD. 108-20'!O58>0),\"X\",\"\")","v":""},{"v":0,"d":"0.000"},{"v":0.03,"d":"0.030"},{"$f":"IF(AND('Calcolo DM 140-12 + ORD. 108-20'!R58<9,'Calcolo DM 140-12 + ORD. 108-20'!R58>0),\"X\",\"\")","v":""},{"v":0,"d":"0.000"},{"v":0.03,"d":"0.030"},{"$nulls":3},{"$f":"IF(#REF!=\"X\",IF(H45=$W$7,ROUND(H$10*H$9*H$13*J45,2),0)+IF(K45=$W$7,ROUND(K$10*K$9*K$13*M45,2),0)+IF(N45=$W$7,ROUND(N$10*N$9*N$13*P45,2),0)+IF(Q45=$W$7,ROUND(Q$10*Q$9*Q$13*S45,2),0),0)","v":{"$error":"#REF!"}},{"$f":"IF(#REF!=\"X\",IF(H45=$X$7,ROUND(H$10*H$9*H$13*J45,2),0)+IF(K45=$X$7,ROUND(K$10*K$9*K$13*M45,2),0)+IF(N45=$X$7,ROUND(N$10*N$9*N$13*P45,2),0)+IF(Q45=$X$7,ROUND(Q$10*Q$9*Q$13*S45,2),0),0)","v":{"$error":"#REF!"}},{"$f":"IF(#REF!=\"X\",IF(H45=$Y$7,ROUND(H$10*H$9*H$13*J45,2),0)+IF(K45=$Y$7,ROUND(K$10*K$9*K$13*M45,2),0)+IF(N45=$Y$7,ROUND(N$10*N$9*N$13*P45,2),0)+IF(Q45=$Y$7,ROUND(Q$10*Q$9*Q$13*S45,2),0),0)","v":{"$error":"#REF!"}},{"$f":"IF(#REF!=\"X\",IF(H45=$Z$7,ROUND(H$10*H$9*H$13*J45,2),0)+IF(K45=$Z$7,ROUND(K$10*K$9*K$13*M45,2),0)+IF(N45=$Z$7,ROUND(N$10*N$9*N$13*P45,2),0)+IF(Q45=$Z$7,ROUND(Q$10*Q$9*Q$13*S45,2),0),0)","v":{"$error":"#REF!"}},{"$f":"IF(#REF!=\"X\",IF(H45=$AA$7,ROUND(H$10*H$9*H$13*J45,2),0)+IF(K45=$AA$7,ROUND(K$10*K$9*K$13*M45,2),0)+IF(N45=$AA$7,ROUND(N$10*N$9*N$13*P45,2),0)+IF(Q45=$AA$7,ROUND(Q$10*Q$9*Q$13*S45,2),0),0)","v":{"$error":"#REF!"}},{"$f":"IF(#REF!=\"X\",IF(H45=$AB$7,ROUND(H$10*H$9*H$13*J45,2),0)+IF(K45=$AB$7,ROUND(K$10*K$9*K$13*M45,2),0)+IF(N45=$AB$7,ROUND(N$10*N$9*N$13*P45,2),0)+IF(Q45=$AB$7,ROUND(Q$10*Q$9*Q$13*S45,2),0),0)","v":{"$error":"#REF!"}},{"$f":"IF(#REF!=\"X\",IF(H45=$AC$7,ROUND(H$10*H$9*H$13*J45,2),0)+IF(K45=$AC$7,ROUND(K$10*K$9*K$13*M45,2),0)+IF(N45=$AC$7,ROUND(N$10*N$9*N$13*P45,2),0)+IF(Q45=$AC$7,ROUND(Q$10*Q$9*Q$13*S45,2),0),0)","v":{"$error":"#REF!"}},{"$f":"IF(#REF!=\"X\",IF(H45=$AD$7,ROUND(H$10*H$9*H$13*J45,2),0)+IF(K45=$AD$7,ROUND(K$10*K$9*K$13*M45,2),0)+IF(N45=$AD$7,ROUND(N$10*N$9*N$13*P45,2),0)+IF(Q45=$AD$7,ROUND(Q$10*Q$9*Q$13*S45,2),0),0)","v":{"$error":"#REF!"}}]
[1,{"$nulls":4},"QbII.09\nQps.05.02"," Relazione di indagine sismica (art.19, comma 1, d.P.R. 207/10)  ",{"$f":"IF(AND('Calcolo DM 140-12 + ORD. 108-20'!I59<9,'Calcolo DM 140-12 + ORD. 108-20'!I59>0),\"X\",\"\")","v":""},{"v":0,"d":"0.000"},{"v":0.03,"d":"0.030"},{"$f":"IF(AND('Calcolo DM 140-12 + ORD. 108-20'!L59<9,'Calcolo DM 140-12 + ORD. 108-20'!L59>0),\"X\",\"\")","v":""},{"v":0,"d":"0.000"},{"v":0.03,"d":"0.030"},{"$f":"IF(AND('Calcolo DM 140-12 + ORD. 108-20'!O59<9,'Calcolo DM 140-12 + ORD. 108-20'!O59>0),\"X\",\"\")","v":""},{"v":0,"d":"0.000"},{"v":0.03,"d":"0.030"},{"$f":"IF(AND('Calcolo DM 140-12 + ORD. 108-20'!R59<9,'Calcolo DM 140-12 + ORD. 108-20'!R59>0),\"X\",\"\")","v":""},{"v":0,"d":"0.000"},{"v":0.03,"d":"0.030"},{"$nulls":3},{"$f":"IF(#REF!=\"X\",IF(H46=$W$7,ROUND(H$10*H$9*H$13*J46,2),0)+IF(K46=$W$7,ROUND(K$10*K$9*K$13*M46,2),0)+IF(N46=$W$7,ROUND(N$10*N$9*N$13*P46,2),0)+IF(Q46=$W$7,ROUND(Q$10*Q$9*Q$13*S46,2),0),0)","v":{"$error":"#REF!"}},{"$f":"IF(#REF!=\"X\",IF(H46=$X$7,ROUND(H$10*H$9*H$13*J46,2),0)+IF(K46=$X$7,ROUND(K$10*K$9*K$13*M46,2),0)+IF(N46=$X$7,ROUND(N$10*N$9*N$13*P46,2),0)+IF(Q46=$X$7,ROUND(Q$10*Q$9*Q$13*S46,2),0),0)","v":{"$error":"#REF!"}},{"$f":"IF(#REF!=\"X\",IF(H46=$Y$7,ROUND(H$10*H$9*H$13*J46,2),0)+IF(K46=$Y$7,ROUND(K$10*K$9*K$13*M46,2),0)+IF(N46=$Y$7,ROUND(N$10*N$9*N$13*P46,2),0)+IF(Q46=$Y$7,ROUND(Q$10*Q$9*Q$13*S46,2),0),0)","v":{"$error":"#REF!"}},{"$f":"IF(#REF!=\"X\",IF(H46=$Z$7,ROUND(H$10*H$9*H$13*J46,2),0)+IF(K46=$Z$7,ROUND(K$10*K$9*K$13*M46,2),0)+IF(N46=$Z$7,ROUND(N$10*N$9*N$13*P46,2),0)+IF(Q46=$Z$7,ROUND(Q$10*Q$9*Q$13*S46,2),0),0)","v":{"$error":"#REF!"}},{"$f":"IF(#REF!=\"X\",IF(H46=$AA$7,ROUND(H$10*H$9*H$13*J46,2),0)+IF(K46=$AA$7,ROUND(K$10*K$9*K$13*M46,2),0)+IF(N46=$AA$7,ROUND(N$10*N$9*N$13*P46,2),0)+IF(Q46=$AA$7,ROUND(Q$10*Q$9*Q$13*S46,2),0),0)","v":{"$error":"#REF!"}},{"$f":"IF(#REF!=\"X\",IF(H46=$AB$7,ROUND(H$10*H$9*H$13*J46,2),0)+IF(K46=$AB$7,ROUND(K$10*K$9*K$13*M46,2),0)+IF(N46=$AB$7,ROUND(N$10*N$9*N$13*P46,2),0)+IF(Q46=$AB$7,ROUND(Q$10*Q$9*Q$13*S46,2),0),0)","v":{"$error":"#REF!"}},{"$f":"IF(#REF!=\"X\",IF(H46=$AC$7,ROUND(H$10*H$9*H$13*J46,2),0)+IF(K46=$AC$7,ROUND(K$10*K$9*K$13*M46,2),0)+IF(N46=$AC$7,ROUND(N$10*N$9*N$13*P46,2),0)+IF(Q46=$AC$7,ROUND(Q$10*Q$9*Q$13*S46,2),0),0)","v":{"$error":"#REF!"}},{"$f":"IF(#REF!=\"X\",IF(H46=$AD$7,ROUND(H$10*H$9*H$13*J46,2),0)+IF(K46=$AD$7,ROUND(K$10*K$9*K$13*M46,2),0)+IF(N46=$AD$7,ROUND(N$10*N$9*N$13*P46,2),0)+IF(Q46=$AD$7,ROUND(Q$10*Q$9*Q$13*S46,2),0),0)","v":{"$error":"#REF!"}},{"$nulls":3},"X","X","X"]
[1,{"$nulls":4},"QbII.10\nQps.10.02"," Relazione di indagine geologica (art.26, comma 1, d.P.R. 207/2010)  ",{"$f":"IF(AND('Calcolo DM 140-12 + ORD. 108-20'!I60<9,'Calcolo DM 140-12 + ORD. 108-20'!I60>0),\"X\",\"\")","v":""},{"v":0,"d":"0.000"},{"v":0.15,"d":"0.150"},{"$f":"IF(AND('Calcolo DM 140-12 + ORD. 108-20'!L60<9,'Calcolo DM 140-12 + ORD. 108-20'!L60>0),\"X\",\"\")","v":""},{"v":0,"d":"0.000"},{"v":0.15,"d":"0.150"},{"$f":"IF(AND('Calcolo DM 140-12 + ORD. 108-20'!O60<9,'Calcolo DM 140-12 + ORD. 108-20'!O60>0),\"X\",\"\")","v":""},{"v":0,"d":"0.000"},{"v":0.15,"d":"0.150"},{"$f":"IF(AND('Calcolo DM 140-12 + ORD. 108-20'!R60<9,'Calcolo DM 140-12 + ORD. 108-20'!R60>0),\"X\",\"\")","v":""},{"v":0,"d":"0.000"},{"v":0.15,"d":"0.150"},{"$nulls":3},{"$f":"IF(#REF!=\"X\",IF(H47=$W$7,ROUND(H$10*H$9*H$13*J47,2),0)+IF(K47=$W$7,ROUND(K$10*K$9*K$13*M47,2),0)+IF(N47=$W$7,ROUND(N$10*N$9*N$13*P47,2),0)+IF(Q47=$W$7,ROUND(Q$10*Q$9*Q$13*S47,2),0),0)","v":{"$error":"#REF!"}},{"$f":"IF(#REF!=\"X\",IF(H47=$X$7,ROUND(H$10*H$9*H$13*J47,2),0)+IF(K47=$X$7,ROUND(K$10*K$9*K$13*M47,2),0)+IF(N47=$X$7,ROUND(N$10*N$9*N$13*P47,2),0)+IF(Q47=$X$7,ROUND(Q$10*Q$9*Q$13*S47,2),0),0)","v":{"$error":"#REF!"}},{"$f":"IF(#REF!=\"X\",IF(H47=$Y$7,ROUND(H$10*H$9*H$13*J47,2),0)+IF(K47=$Y$7,ROUND(K$10*K$9*K$13*M47,2),0)+IF(N47=$Y$7,ROUND(N$10*N$9*N$13*P47,2),0)+IF(Q47=$Y$7,ROUND(Q$10*Q$9*Q$13*S47,2),0),0)","v":{"$error":"#REF!"}},{"$f":"IF(#REF!=\"X\",IF(H47=$Z$7,ROUND(H$10*H$9*H$13*J47,2),0)+IF(K47=$Z$7,ROUND(K$10*K$9*K$13*M47,2),0)+IF(N47=$Z$7,ROUND(N$10*N$9*N$13*P47,2),0)+IF(Q47=$Z$7,ROUND(Q$10*Q$9*Q$13*S47,2),0),0)","v":{"$error":"#REF!"}},{"$f":"IF(#REF!=\"X\",IF(H47=$AA$7,ROUND(H$10*H$9*H$13*J47,2),0)+IF(K47=$AA$7,ROUND(K$10*K$9*K$13*M47,2),0)+IF(N47=$AA$7,ROUND(N$10*N$9*N$13*P47,2),0)+IF(Q47=$AA$7,ROUND(Q$10*Q$9*Q$13*S47,2),0),0)","v":{"$error":"#REF!"}},{"$f":"IF(#REF!=\"X\",IF(H47=$AB$7,ROUND(H$10*H$9*H$13*J47,2),0)+IF(K47=$AB$7,ROUND(K$10*K$9*K$13*M47,2),0)+IF(N47=$AB$7,ROUND(N$10*N$9*N$13*P47,2),0)+IF(Q47=$AB$7,ROUND(Q$10*Q$9*Q$13*S47,2),0),0)","v":{"$error":"#REF!"}},{"$f":"IF(#REF!=\"X\",IF(H47=$AC$7,ROUND(H$10*H$9*H$13*J47,2),0)+IF(K47=$AC$7,ROUND(K$10*K$9*K$13*M47,2),0)+IF(N47=$AC$7,ROUND(N$10*N$9*N$13*P47,2),0)+IF(Q47=$AC$7,ROUND(Q$10*Q$9*Q$13*S47,2),0),0)","v":{"$error":"#REF!"}},{"$f":"IF(#REF!=\"X\",IF(H47=$AD$7,ROUND(H$10*H$9*H$13*J47,2),0)+IF(K47=$AD$7,ROUND(K$10*K$9*K$13*M47,2),0)+IF(N47=$AD$7,ROUND(N$10*N$9*N$13*P47,2),0)+IF(Q47=$AD$7,ROUND(Q$10*Q$9*Q$13*S47,2),0),0)","v":{"$error":"#REF!"}}]
[{"$f":"IF(K48<>\"\",\"\",1)","v":1},{"$nulls":4},"QbII.11\nQps.06"," Analisi storico critica e relazione sulle strutture esistenti (art.26, d.P.R. 207/10 \u0081-cap.8,5, d.m. 14/01/2008)  ","  ",null,null,{"$f":"IF(AND('Calcolo DM 140-12 + ORD. 108-20'!L61<9,'Calcolo DM 140-12 + ORD. 108-20'!L61>0),\"X\",\"\")","v":""},{"v":0,"d":"0.000"},{"v":0.09,"d":"0.090"},"  ",null,null,"  ",{"$nulls":5},{"$f":"IF(#REF!=\"X\",IF(H48=$W$7,ROUND(H$10*H$9*H$13*J48,2),0)+IF(K48=$W$7,ROUND(K$10*K$9*K$13*M48,2),0)+IF(N48=$W$7,ROUND(N$10*N$9*N$13*P48,2),0)+IF(Q48=$W$7,ROUND(Q$10*Q$9*Q$13*S48,2),0),0)","v":{"$error":"#REF!"}},{"$f":"IF(#REF!=\"X\",IF(H48=$X$7,ROUND(H$10*H$9*H$13*J48,2),0)+IF(K48=$X$7,ROUND(K$10*K$9*K$13*M48,2),0)+IF(N48=$X$7,ROUND(N$10*N$9*N$13*P48,2),0)+IF(Q48=$X$7,ROUND(Q$10*Q$9*Q$13*S48,2),0),0)","v":{"$error":"#REF!"}},{"$f":"IF(#REF!=\"X\",IF(H48=$Y$7,ROUND(H$10*H$9*H$13*J48,2),0)+IF(K48=$Y$7,ROUND(K$10*K$9*K$13*M48,2),0)+IF(N48=$Y$7,ROUND(N$10*N$9*N$13*P48,2),0)+IF(Q48=$Y$7,ROUND(Q$10*Q$9*Q$13*S48,2),0),0)","v":{"$error":"#REF!"}},{"$f":"IF(#REF!=\"X\",IF(H48=$Z$7,ROUND(H$10*H$9*H$13*J48,2),0)+IF(K48=$Z$7,ROUND(K$10*K$9*K$13*M48,2),0)+IF(N48=$Z$7,ROUND(N$10*N$9*N$13*P48,2),0)+IF(Q48=$Z$7,ROUND(Q$10*Q$9*Q$13*S48,2),0),0)","v":{"$error":"#REF!"}},{"$f":"IF(#REF!=\"X\",IF(H48=$AA$7,ROUND(H$10*H$9*H$13*J48,2),0)+IF(K48=$AA$7,ROUND(K$10*K$9*K$13*M48,2),0)+IF(N48=$AA$7,ROUND(N$10*N$9*N$13*P48,2),0)+IF(Q48=$AA$7,ROUND(Q$10*Q$9*Q$13*S48,2),0),0)","v":{"$error":"#REF!"}},{"$f":"IF(#REF!=\"X\",IF(H48=$AB$7,ROUND(H$10*H$9*H$13*J48,2),0)+IF(K48=$AB$7,ROUND(K$10*K$9*K$13*M48,2),0)+IF(N48=$AB$7,ROUND(N$10*N$9*N$13*P48,2),0)+IF(Q48=$AB$7,ROUND(Q$10*Q$9*Q$13*S48,2),0),0)","v":{"$error":"#REF!"}},{"$f":"IF(#REF!=\"X\",IF(H48=$AC$7,ROUND(H$10*H$9*H$13*J48,2),0)+IF(K48=$AC$7,ROUND(K$10*K$9*K$13*M48,2),0)+IF(N48=$AC$7,ROUND(N$10*N$9*N$13*P48,2),0)+IF(Q48=$AC$7,ROUND(Q$10*Q$9*Q$13*S48,2),0),0)","v":{"$error":"#REF!"}},{"$f":"IF(#REF!=\"X\",IF(H48=$AD$7,ROUND(H$10*H$9*H$13*J48,2),0)+IF(K48=$AD$7,ROUND(K$10*K$9*K$13*M48,2),0)+IF(N48=$AD$7,ROUND(N$10*N$9*N$13*P48,2),0)+IF(Q48=$AD$7,ROUND(Q$10*Q$9*Q$13*S48,2),0),0)","v":{"$error":"#REF!"}},{"$nulls":4},"X","X","X"]
[{"$f":"IF(K49<>\"\",\"\",1)","v":1},{"$nulls":4},"QbII.12\nQps.07"," Relazione sulle indagini dei materiali e delle strutture per edifici esistenti (art.26, d.P.R. 207)  ","  ",null,null,{"$f":"IF(AND('Calcolo DM 140-12 + ORD. 108-20'!L62<9,'Calcolo DM 140-12 + ORD. 108-20'!L62>0),\"X\",\"\")","v":""},{"v":0,"d":"0.000"},{"v":0.12,"d":"0.120"},"  ",null,null,"  ",{"$nulls":5},{"$f":"IF(#REF!=\"X\",IF(H49=$W$7,ROUND(H$10*H$9*H$13*J49,2),0)+IF(K49=$W$7,ROUND(K$10*K$9*K$13*M49,2),0)+IF(N49=$W$7,ROUND(N$10*N$9*N$13*P49,2),0)+IF(Q49=$W$7,ROUND(Q$10*Q$9*Q$13*S49,2),0),0)","v":{"$error":"#REF!"}},{"$f":"IF(#REF!=\"X\",IF(H49=$X$7,ROUND(H$10*H$9*H$13*J49,2),0)+IF(K49=$X$7,ROUND(K$10*K$9*K$13*M49,2),0)+IF(N49=$X$7,ROUND(N$10*N$9*N$13*P49,2),0)+IF(Q49=$X$7,ROUND(Q$10*Q$9*Q$13*S49,2),0),0)","v":{"$error":"#REF!"}},{"$f":"IF(#REF!=\"X\",IF(H49=$Y$7,ROUND(H$10*H$9*H$13*J49,2),0)+IF(K49=$Y$7,ROUND(K$10*K$9*K$13*M49,2),0)+IF(N49=$Y$7,ROUND(N$10*N$9*N$13*P49,2),0)+IF(Q49=$Y$7,ROUND(Q$10*Q$9*Q$13*S49,2),0),0)","v":{"$error":"#REF!"}},{"$f":"IF(#REF!=\"X\",IF(H49=$Z$7,ROUND(H$10*H$9*H$13*J49,2),0)+IF(K49=$Z$7,ROUND(K$10*K$9*K$13*M49,2),0)+IF(N49=$Z$7,ROUND(N$10*N$9*N$13*P49,2),0)+IF(Q49=$Z$7,ROUND(Q$10*Q$9*Q$13*S49,2),0),0)","v":{"$error":"#REF!"}},{"$f":"IF(#REF!=\"X\",IF(H49=$AA$7,ROUND(H$10*H$9*H$13*J49,2),0)+IF(K49=$AA$7,ROUND(K$10*K$9*K$13*M49,2),0)+IF(N49=$AA$7,ROUND(N$10*N$9*N$13*P49,2),0)+IF(Q49=$AA$7,ROUND(Q$10*Q$9*Q$13*S49,2),0),0)","v":{"$error":"#REF!"}},{"$f":"IF(#REF!=\"X\",IF(H49=$AB$7,ROUND(H$10*H$9*H$13*J49,2),0)+IF(K49=$AB$7,ROUND(K$10*K$9*K$13*M49,2),0)+IF(N49=$AB$7,ROUND(N$10*N$9*N$13*P49,2),0)+IF(Q49=$AB$7,ROUND(Q$10*Q$9*Q$13*S49,2),0),0)","v":{"$error":"#REF!"}},{"$f":"IF(#REF!=\"X\",IF(H49=$AC$7,ROUND(H$10*H$9*H$13*J49,2),0)+IF(K49=$AC$7,ROUND(K$10*K$9*K$13*M49,2),0)+IF(N49=$AC$7,ROUND(N$10*N$9*N$13*P49,2),0)+IF(Q49=$AC$7,ROUND(Q$10*Q$9*Q$13*S49,2),0),0)","v":{"$error":"#REF!"}},{"$f":"IF(#REF!=\"X\",IF(H49=$AD$7,ROUND(H$10*H$9*H$13*J49,2),0)+IF(K49=$AD$7,ROUND(K$10*K$9*K$13*M49,2),0)+IF(N49=$AD$7,ROUND(N$10*N$9*N$13*P49,2),0)+IF(Q49=$AD$7,ROUND(Q$10*Q$9*Q$13*S49,2),0),0)","v":{"$error":"#REF!"}},{"$nulls":4},"X","X","X"]
[{"$f":"IF(K50<>\"\",\"\",1)","v":1},{"$nulls":4},"QbII.13\nQps.08"," Verifica sismica delle strutture esistenti e individuazione delle carenza strutturali (art.26, d.P.R. \u0081- cap.8,5, d.m. 14/01/2008)  ","  ",null,null,{"$f":"IF(AND('Calcolo DM 140-12 + ORD. 108-20'!L63<9,'Calcolo DM 140-12 + ORD. 108-20'!L63>0),\"X\",\"\")","v":""},{"v":0,"d":"0.000"},{"v":0.18,"d":"0.180"},"  ",null,null,"  ",{"$nulls":5},{"$f":"IF(#REF!=\"X\",IF(H50=$W$7,ROUND(H$10*H$9*H$13*J50,2),0)+IF(K50=$W$7,ROUND(K$10*K$9*K$13*M50,2),0)+IF(N50=$W$7,ROUND(N$10*N$9*N$13*P50,2),0)+IF(Q50=$W$7,ROUND(Q$10*Q$9*Q$13*S50,2),0),0)","v":{"$error":"#REF!"}},{"$f":"IF(#REF!=\"X\",IF(H50=$X$7,ROUND(H$10*H$9*H$13*J50,2),0)+IF(K50=$X$7,ROUND(K$10*K$9*K$13*M50,2),0)+IF(N50=$X$7,ROUND(N$10*N$9*N$13*P50,2),0)+IF(Q50=$X$7,ROUND(Q$10*Q$9*Q$13*S50,2),0),0)","v":{"$error":"#REF!"}},{"$f":"IF(#REF!=\"X\",IF(H50=$Y$7,ROUND(H$10*H$9*H$13*J50,2),0)+IF(K50=$Y$7,ROUND(K$10*K$9*K$13*M50,2),0)+IF(N50=$Y$7,ROUND(N$10*N$9*N$13*P50,2),0)+IF(Q50=$Y$7,ROUND(Q$10*Q$9*Q$13*S50,2),0),0)","v":{"$error":"#REF!"}},{"$f":"IF(#REF!=\"X\",IF(H50=$Z$7,ROUND(H$10*H$9*H$13*J50,2),0)+IF(K50=$Z$7,ROUND(K$10*K$9*K$13*M50,2),0)+IF(N50=$Z$7,ROUND(N$10*N$9*N$13*P50,2),0)+IF(Q50=$Z$7,ROUND(Q$10*Q$9*Q$13*S50,2),0),0)","v":{"$error":"#REF!"}},{"$f":"IF(#REF!=\"X\",IF(H50=$AA$7,ROUND(H$10*H$9*H$13*J50,2),0)+IF(K50=$AA$7,ROUND(K$10*K$9*K$13*M50,2),0)+IF(N50=$AA$7,ROUND(N$10*N$9*N$13*P50,2),0)+IF(Q50=$AA$7,ROUND(Q$10*Q$9*Q$13*S50,2),0),0)","v":{"$error":"#REF!"}},{"$f":"IF(#REF!=\"X\",IF(H50=$AB$7,ROUND(H$10*H$9*H$13*J50,2),0)+IF(K50=$AB$7,ROUND(K$10*K$9*K$13*M50,2),0)+IF(N50=$AB$7,ROUND(N$10*N$9*N$13*P50,2),0)+IF(Q50=$AB$7,ROUND(Q$10*Q$9*Q$13*S50,2),0),0)","v":{"$error":"#REF!"}},{"$f":"IF(#REF!=\"X\",IF(H50=$AC$7,ROUND(H$10*H$9*H$13*J50,2),0)+IF(K50=$AC$7,ROUND(K$10*K$9*K$13*M50,2),0)+IF(N50=$AC$7,ROUND(N$10*N$9*N$13*P50,2),0)+IF(Q50=$AC$7,ROUND(Q$10*Q$9*Q$13*S50,2),0),0)","v":{"$error":"#REF!"}},{"$f":"IF(#REF!=\"X\",IF(H50=$AD$7,ROUND(H$10*H$9*H$13*J50,2),0)+IF(K50=$AD$7,ROUND(K$10*K$9*K$13*M50,2),0)+IF(N50=$AD$7,ROUND(N$10*N$9*N$13*P50,2),0)+IF(Q50=$AD$7,ROUND(Q$10*Q$9*Q$13*S50,2),0),0)","v":{"$error":"#REF!"}},{"$nulls":4},"X","X","X"]
[1,{"$nulls":4}," QbII.14  "," Progettazione integrale e coordinata \u0081- Integrazione delle prestazioni specialistiche (art.90, comma 7, d.lgs. 163/2006)  ",{"$f":"IF(AND('Calcolo DM 140-12 + ORD. 108-20'!I64<9,'Calcolo DM 140-12 + ORD. 108-20'!I64>0),\"X\",\"\")","v":""},{"$f":"IF(H51=\"X\",J51,0)","v":{"v":0,"d":"0.000"}},{"v":0.05,"d":"0.050"},{"$f":"IF(AND('Calcolo DM 140-12 + ORD. 108-20'!L64<9,'Calcolo DM 140-12 + ORD. 108-20'!L64>0),\"X\",\"\")","v":""},{"v":0,"d":"0.000"},{"v":0.05,"d":"0.050"},{"$f":"IF(AND('Calcolo DM 140-12 + ORD. 108-20'!O64<9,'Calcolo DM 140-12 + ORD. 108-20'!O64>0),\"X\",\"\")","v":""},{"$f":"IF(N51=\"X\",P51,0)","v":{"v":0,"d":"0.000"}},{"v":0.05,"d":"0.050"},{"$f":"IF(AND('Calcolo DM 140-12 + ORD. 108-20'!R64<9,'Calcolo DM 140-12 + ORD. 108-20'!R64>0),\"X\",\"\")","v":""},{"$f":"IF(Q51=\"X\",S51,0)","v":{"v":0,"d":"0.000"}},{"v":0.05,"d":"0.050"},{"$nulls":3},{"$f":"IF(#REF!=\"X\",IF(H51=$W$7,ROUND(H$10*H$9*H$13*J51,2),0)+IF(K51=$W$7,ROUND(K$10*K$9*K$13*M51,2),0)+IF(N51=$W$7,ROUND(N$10*N$9*N$13*P51,2),0)+IF(Q51=$W$7,ROUND(Q$10*Q$9*Q$13*S51,2),0),0)","v":{"$error":"#REF!"}},{"$f":"IF(#REF!=\"X\",IF(H51=$X$7,ROUND(H$10*H$9*H$13*J51,2),0)+IF(K51=$X$7,ROUND(K$10*K$9*K$13*M51,2),0)+IF(N51=$X$7,ROUND(N$10*N$9*N$13*P51,2),0)+IF(Q51=$X$7,ROUND(Q$10*Q$9*Q$13*S51,2),0),0)","v":{"$error":"#REF!"}},{"$f":"IF(#REF!=\"X\",IF(H51=$Y$7,ROUND(H$10*H$9*H$13*J51,2),0)+IF(K51=$Y$7,ROUND(K$10*K$9*K$13*M51,2),0)+IF(N51=$Y$7,ROUND(N$10*N$9*N$13*P51,2),0)+IF(Q51=$Y$7,ROUND(Q$10*Q$9*Q$13*S51,2),0),0)","v":{"$error":"#REF!"}},{"$f":"IF(#REF!=\"X\",IF(H51=$Z$7,ROUND(H$10*H$9*H$13*J51,2),0)+IF(K51=$Z$7,ROUND(K$10*K$9*K$13*M51,2),0)+IF(N51=$Z$7,ROUND(N$10*N$9*N$13*P51,2),0)+IF(Q51=$Z$7,ROUND(Q$10*Q$9*Q$13*S51,2),0),0)","v":{"$error":"#REF!"}},{"$f":"IF(#REF!=\"X\",IF(H51=$AA$7,ROUND(H$10*H$9*H$13*J51,2),0)+IF(K51=$AA$7,ROUND(K$10*K$9*K$13*M51,2),0)+IF(N51=$AA$7,ROUND(N$10*N$9*N$13*P51,2),0)+IF(Q51=$AA$7,ROUND(Q$10*Q$9*Q$13*S51,2),0),0)","v":{"$error":"#REF!"}},{"$f":"IF(#REF!=\"X\",IF(H51=$AB$7,ROUND(H$10*H$9*H$13*J51,2),0)+IF(K51=$AB$7,ROUND(K$10*K$9*K$13*M51,2),0)+IF(N51=$AB$7,ROUND(N$10*N$9*N$13*P51,2),0)+IF(Q51=$AB$7,ROUND(Q$10*Q$9*Q$13*S51,2),0),0)","v":{"$error":"#REF!"}},{"$f":"IF(#REF!=\"X\",IF(H51=$AC$7,ROUND(H$10*H$9*H$13*J51,2),0)+IF(K51=$AC$7,ROUND(K$10*K$9*K$13*M51,2),0)+IF(N51=$AC$7,ROUND(N$10*N$9*N$13*P51,2),0)+IF(Q51=$AC$7,ROUND(Q$10*Q$9*Q$13*S51,2),0),0)","v":{"$error":"#REF!"}},{"$f":"IF(#REF!=\"X\",IF(H51=$AD$7,ROUND(H$10*H$9*H$13*J51,2),0)+IF(K51=$AD$7,ROUND(K$10*K$9*K$13*M51,2),0)+IF(N51=$AD$7,ROUND(N$10*N$9*N$13*P51,2),0)+IF(Q51=$AD$7,ROUND(Q$10*Q$9*Q$13*S51,2),0),0)","v":{"$error":"#REF!"}}]
[1,{"$nulls":4},"QbII.15\nQps.11.02"," Elaborati di progettazione antincendio (d.m. 16/02/1982)  ",{"$f":"IF(AND('Calcolo DM 140-12 + ORD. 108-20'!I65<9,'Calcolo DM 140-12 + ORD. 108-20'!I65>0),\"X\",\"\")","v":""},{"v":0,"d":"0.000"},{"v":0.06,"d":"0.060"},{"$f":"IF(AND('Calcolo DM 140-12 + ORD. 108-20'!L65<9,'Calcolo DM 140-12 + ORD. 108-20'!L65>0),\"X\",\"\")","v":""},{"v":0,"d":"0.000"},{"v":0.06,"d":"0.060"},{"$f":"IF(AND('Calcolo DM 140-12 + ORD. 108-20'!O65<9,'Calcolo DM 140-12 + ORD. 108-20'!O65>0),\"X\",\"\")","v":""},{"v":0,"d":"0.000"},{"v":0.06,"d":"0.060"},{"$f":"IF(AND('Calcolo DM 140-12 + ORD. 108-20'!R65<9,'Calcolo DM 140-12 + ORD. 108-20'!R65>0),\"X\",\"\")","v":""},{"v":0,"d":"0.000"},{"v":0.06,"d":"0.060"},{"$nulls":3},{"$f":"IF(#REF!=\"X\",IF(H52=$W$7,ROUND(H$10*H$9*H$13*J52,2),0)+IF(K52=$W$7,ROUND(K$10*K$9*K$13*M52,2),0)+IF(N52=$W$7,ROUND(N$10*N$9*N$13*P52,2),0)+IF(Q52=$W$7,ROUND(Q$10*Q$9*Q$13*S52,2),0),0)","v":{"$error":"#REF!"}},{"$f":"IF(#REF!=\"X\",IF(H52=$X$7,ROUND(H$10*H$9*H$13*J52,2),0)+IF(K52=$X$7,ROUND(K$10*K$9*K$13*M52,2),0)+IF(N52=$X$7,ROUND(N$10*N$9*N$13*P52,2),0)+IF(Q52=$X$7,ROUND(Q$10*Q$9*Q$13*S52,2),0),0)","v":{"$error":"#REF!"}},{"$f":"IF(#REF!=\"X\",IF(H52=$Y$7,ROUND(H$10*H$9*H$13*J52,2),0)+IF(K52=$Y$7,ROUND(K$10*K$9*K$13*M52,2),0)+IF(N52=$Y$7,ROUND(N$10*N$9*N$13*P52,2),0)+IF(Q52=$Y$7,ROUND(Q$10*Q$9*Q$13*S52,2),0),0)","v":{"$error":"#REF!"}},{"$f":"IF(#REF!=\"X\",IF(H52=$Z$7,ROUND(H$10*H$9*H$13*J52,2),0)+IF(K52=$Z$7,ROUND(K$10*K$9*K$13*M52,2),0)+IF(N52=$Z$7,ROUND(N$10*N$9*N$13*P52,2),0)+IF(Q52=$Z$7,ROUND(Q$10*Q$9*Q$13*S52,2),0),0)","v":{"$error":"#REF!"}},{"$f":"IF(#REF!=\"X\",IF(H52=$AA$7,ROUND(H$10*H$9*H$13*J52,2),0)+IF(K52=$AA$7,ROUND(K$10*K$9*K$13*M52,2),0)+IF(N52=$AA$7,ROUND(N$10*N$9*N$13*P52,2),0)+IF(Q52=$AA$7,ROUND(Q$10*Q$9*Q$13*S52,2),0),0)","v":{"$error":"#REF!"}},{"$f":"IF(#REF!=\"X\",IF(H52=$AB$7,ROUND(H$10*H$9*H$13*J52,2),0)+IF(K52=$AB$7,ROUND(K$10*K$9*K$13*M52,2),0)+IF(N52=$AB$7,ROUND(N$10*N$9*N$13*P52,2),0)+IF(Q52=$AB$7,ROUND(Q$10*Q$9*Q$13*S52,2),0),0)","v":{"$error":"#REF!"}},{"$f":"IF(#REF!=\"X\",IF(H52=$AC$7,ROUND(H$10*H$9*H$13*J52,2),0)+IF(K52=$AC$7,ROUND(K$10*K$9*K$13*M52,2),0)+IF(N52=$AC$7,ROUND(N$10*N$9*N$13*P52,2),0)+IF(Q52=$AC$7,ROUND(Q$10*Q$9*Q$13*S52,2),0),0)","v":{"$error":"#REF!"}},{"$f":"IF(#REF!=\"X\",IF(H52=$AD$7,ROUND(H$10*H$9*H$13*J52,2),0)+IF(K52=$AD$7,ROUND(K$10*K$9*K$13*M52,2),0)+IF(N52=$AD$7,ROUND(N$10*N$9*N$13*P52,2),0)+IF(Q52=$AD$7,ROUND(Q$10*Q$9*Q$13*S52,2),0),0)","v":{"$error":"#REF!"}}]
[1,{"$nulls":4},"QbII.16\nQps.13"," Relazione paesaggistica (d.lgs. 42/2004)  ",{"$f":"IF(AND('Calcolo DM 140-12 + ORD. 108-20'!I66<9,'Calcolo DM 140-12 + ORD. 108-20'!I66>0),\"X\",\"\")","v":""},{"v":0,"d":"0.000"},{"v":0.02,"d":"0.020"},{"$f":"IF(AND('Calcolo DM 140-12 + ORD. 108-20'!L66<9,'Calcolo DM 140-12 + ORD. 108-20'!L66>0),\"X\",\"\")","v":""},{"v":0,"d":"0.000"},{"v":0.02,"d":"0.020"},{"$f":"IF(AND('Calcolo DM 140-12 + ORD. 108-20'!O66<9,'Calcolo DM 140-12 + ORD. 108-20'!O66>0),\"X\",\"\")","v":""},{"v":0,"d":"0.000"},{"v":0.02,"d":"0.020"},{"$f":"IF(AND('Calcolo DM 140-12 + ORD. 108-20'!R66<9,'Calcolo DM 140-12 + ORD. 108-20'!R66>0),\"X\",\"\")","v":""},{"v":0,"d":"0.000"},{"v":0.02,"d":"0.020"},{"$nulls":3},{"$f":"IF(#REF!=\"X\",IF(H53=$W$7,ROUND(H$10*H$9*H$13*J53,2),0)+IF(K53=$W$7,ROUND(K$10*K$9*K$13*M53,2),0)+IF(N53=$W$7,ROUND(N$10*N$9*N$13*P53,2),0)+IF(Q53=$W$7,ROUND(Q$10*Q$9*Q$13*S53,2),0),0)","v":{"$error":"#REF!"}},{"$f":"IF(#REF!=\"X\",IF(H53=$X$7,ROUND(H$10*H$9*H$13*J53,2),0)+IF(K53=$X$7,ROUND(K$10*K$9*K$13*M53,2),0)+IF(N53=$X$7,ROUND(N$10*N$9*N$13*P53,2),0)+IF(Q53=$X$7,ROUND(Q$10*Q$9*Q$13*S53,2),0),0)","v":{"$error":"#REF!"}},{"$f":"IF(#REF!=\"X\",IF(H53=$Y$7,ROUND(H$10*H$9*H$13*J53,2),0)+IF(K53=$Y$7,ROUND(K$10*K$9*K$13*M53,2),0)+IF(N53=$Y$7,ROUND(N$10*N$9*N$13*P53,2),0)+IF(Q53=$Y$7,ROUND(Q$10*Q$9*Q$13*S53,2),0),0)","v":{"$error":"#REF!"}},{"$f":"IF(#REF!=\"X\",IF(H53=$Z$7,ROUND(H$10*H$9*H$13*J53,2),0)+IF(K53=$Z$7,ROUND(K$10*K$9*K$13*M53,2),0)+IF(N53=$Z$7,ROUND(N$10*N$9*N$13*P53,2),0)+IF(Q53=$Z$7,ROUND(Q$10*Q$9*Q$13*S53,2),0),0)","v":{"$error":"#REF!"}},{"$f":"IF(#REF!=\"X\",IF(H53=$AA$7,ROUND(H$10*H$9*H$13*J53,2),0)+IF(K53=$AA$7,ROUND(K$10*K$9*K$13*M53,2),0)+IF(N53=$AA$7,ROUND(N$10*N$9*N$13*P53,2),0)+IF(Q53=$AA$7,ROUND(Q$10*Q$9*Q$13*S53,2),0),0)","v":{"$error":"#REF!"}},{"$f":"IF(#REF!=\"X\",IF(H53=$AB$7,ROUND(H$10*H$9*H$13*J53,2),0)+IF(K53=$AB$7,ROUND(K$10*K$9*K$13*M53,2),0)+IF(N53=$AB$7,ROUND(N$10*N$9*N$13*P53,2),0)+IF(Q53=$AB$7,ROUND(Q$10*Q$9*Q$13*S53,2),0),0)","v":{"$error":"#REF!"}},{"$f":"IF(#REF!=\"X\",IF(H53=$AC$7,ROUND(H$10*H$9*H$13*J53,2),0)+IF(K53=$AC$7,ROUND(K$10*K$9*K$13*M53,2),0)+IF(N53=$AC$7,ROUND(N$10*N$9*N$13*P53,2),0)+IF(Q53=$AC$7,ROUND(Q$10*Q$9*Q$13*S53,2),0),0)","v":{"$error":"#REF!"}},{"$f":"IF(#REF!=\"X\",IF(H53=$AD$7,ROUND(H$10*H$9*H$13*J53,2),0)+IF(K53=$AD$7,ROUND(K$10*K$9*K$13*M53,2),0)+IF(N53=$AD$7,ROUND(N$10*N$9*N$13*P53,2),0)+IF(Q53=$AD$7,ROUND(Q$10*Q$9*Q$13*S53,2),0),0)","v":{"$error":"#REF!"}}]
[1,{"$nulls":4},"QbII.17\nQps.14"," Elaborati e relazioni per requisiti acustici (Legge 447/95\u0081]d.p.c.m. 512/97)  ",{"$f":"IF(AND('Calcolo DM 140-12 + ORD. 108-20'!I67<9,'Calcolo DM 140-12 + ORD. 108-20'!I67>0),\"X\",\"\")","v":""},{"v":0,"d":"0.000"},{"v":0.02,"d":"0.020"},{"$f":"IF(AND('Calcolo DM 140-12 + ORD. 108-20'!L67<9,'Calcolo DM 140-12 + ORD. 108-20'!L67>0),\"X\",\"\")","v":""},{"v":0,"d":"0.000"},{"v":0.02,"d":"0.020"},{"$f":"IF(AND('Calcolo DM 140-12 + ORD. 108-20'!O67<9,'Calcolo DM 140-12 + ORD. 108-20'!O67>0),\"X\",\"\")","v":""},{"v":0,"d":"0.000"},{"v":0.02,"d":"0.020"},{"$f":"IF(AND('Calcolo DM 140-12 + ORD. 108-20'!R67<9,'Calcolo DM 140-12 + ORD. 108-20'!R67>0),\"X\",\"\")","v":""},{"v":0,"d":"0.000"},{"v":0.02,"d":"0.020"},{"$nulls":3},{"$f":"IF(#REF!=\"X\",IF(H54=$W$7,ROUND(H$10*H$9*H$13*J54,2),0)+IF(K54=$W$7,ROUND(K$10*K$9*K$13*M54,2),0)+IF(N54=$W$7,ROUND(N$10*N$9*N$13*P54,2),0)+IF(Q54=$W$7,ROUND(Q$10*Q$9*Q$13*S54,2),0),0)","v":{"$error":"#REF!"}},{"$f":"IF(#REF!=\"X\",IF(H54=$X$7,ROUND(H$10*H$9*H$13*J54,2),0)+IF(K54=$X$7,ROUND(K$10*K$9*K$13*M54,2),0)+IF(N54=$X$7,ROUND(N$10*N$9*N$13*P54,2),0)+IF(Q54=$X$7,ROUND(Q$10*Q$9*Q$13*S54,2),0),0)","v":{"$error":"#REF!"}},{"$f":"IF(#REF!=\"X\",IF(H54=$Y$7,ROUND(H$10*H$9*H$13*J54,2),0)+IF(K54=$Y$7,ROUND(K$10*K$9*K$13*M54,2),0)+IF(N54=$Y$7,ROUND(N$10*N$9*N$13*P54,2),0)+IF(Q54=$Y$7,ROUND(Q$10*Q$9*Q$13*S54,2),0),0)","v":{"$error":"#REF!"}},{"$f":"IF(#REF!=\"X\",IF(H54=$Z$7,ROUND(H$10*H$9*H$13*J54,2),0)+IF(K54=$Z$7,ROUND(K$10*K$9*K$13*M54,2),0)+IF(N54=$Z$7,ROUND(N$10*N$9*N$13*P54,2),0)+IF(Q54=$Z$7,ROUND(Q$10*Q$9*Q$13*S54,2),0),0)","v":{"$error":"#REF!"}},{"$f":"IF(#REF!=\"X\",IF(H54=$AA$7,ROUND(H$10*H$9*H$13*J54,2),0)+IF(K54=$AA$7,ROUND(K$10*K$9*K$13*M54,2),0)+IF(N54=$AA$7,ROUND(N$10*N$9*N$13*P54,2),0)+IF(Q54=$AA$7,ROUND(Q$10*Q$9*Q$13*S54,2),0),0)","v":{"$error":"#REF!"}},{"$f":"IF(#REF!=\"X\",IF(H54=$AB$7,ROUND(H$10*H$9*H$13*J54,2),0)+IF(K54=$AB$7,ROUND(K$10*K$9*K$13*M54,2),0)+IF(N54=$AB$7,ROUND(N$10*N$9*N$13*P54,2),0)+IF(Q54=$AB$7,ROUND(Q$10*Q$9*Q$13*S54,2),0),0)","v":{"$error":"#REF!"}},{"$f":"IF(#REF!=\"X\",IF(H54=$AC$7,ROUND(H$10*H$9*H$13*J54,2),0)+IF(K54=$AC$7,ROUND(K$10*K$9*K$13*M54,2),0)+IF(N54=$AC$7,ROUND(N$10*N$9*N$13*P54,2),0)+IF(Q54=$AC$7,ROUND(Q$10*Q$9*Q$13*S54,2),0),0)","v":{"$error":"#REF!"}},{"$f":"IF(#REF!=\"X\",IF(H54=$AD$7,ROUND(H$10*H$9*H$13*J54,2),0)+IF(K54=$AD$7,ROUND(K$10*K$9*K$13*M54,2),0)+IF(N54=$AD$7,ROUND(N$10*N$9*N$13*P54,2),0)+IF(Q54=$AD$7,ROUND(Q$10*Q$9*Q$13*S54,2),0),0)","v":{"$error":"#REF!"}},{"$nulls":3},"X"]
[1,{"$nulls":4},"QbII.18\nQps.15"," Relazione di qualificazione energetica (art.8, d.lgs. 311/2006)  ",{"$f":"IF(AND('Calcolo DM 140-12 + ORD. 108-20'!I68<9,'Calcolo DM 140-12 + ORD. 108-20'!I68>0),\"X\",\"\")","v":""},{"v":0,"d":"0.000"},{"v":0.03,"d":"0.030"},{"$f":"IF(AND('Calcolo DM 140-12 + ORD. 108-20'!L68<9,'Calcolo DM 140-12 + ORD. 108-20'!L68>0),\"X\",\"\")","v":""},{"v":0,"d":"0.000"},{"v":0.03,"d":"0.030"},{"$f":"IF(AND('Calcolo DM 140-12 + ORD. 108-20'!O68<9,'Calcolo DM 140-12 + ORD. 108-20'!O68>0),\"X\",\"\")","v":""},{"v":0,"d":"0.000"},{"v":0.03,"d":"0.030"},{"$f":"IF(AND('Calcolo DM 140-12 + ORD. 108-20'!R68<9,'Calcolo DM 140-12 + ORD. 108-20'!R68>0),\"X\",\"\")","v":""},{"v":0,"d":"0.000"},{"v":0.03,"d":"0.030"},{"$nulls":3},{"$f":"IF(#REF!=\"X\",IF(H55=$W$7,ROUND(H$10*H$9*H$13*J55,2),0)+IF(K55=$W$7,ROUND(K$10*K$9*K$13*M55,2),0)+IF(N55=$W$7,ROUND(N$10*N$9*N$13*P55,2),0)+IF(Q55=$W$7,ROUND(Q$10*Q$9*Q$13*S55,2),0),0)","v":{"$error":"#REF!"}},{"$f":"IF(#REF!=\"X\",IF(H55=$X$7,ROUND(H$10*H$9*H$13*J55,2),0)+IF(K55=$X$7,ROUND(K$10*K$9*K$13*M55,2),0)+IF(N55=$X$7,ROUND(N$10*N$9*N$13*P55,2),0)+IF(Q55=$X$7,ROUND(Q$10*Q$9*Q$13*S55,2),0),0)","v":{"$error":"#REF!"}},{"$f":"IF(#REF!=\"X\",IF(H55=$Y$7,ROUND(H$10*H$9*H$13*J55,2),0)+IF(K55=$Y$7,ROUND(K$10*K$9*K$13*M55,2),0)+IF(N55=$Y$7,ROUND(N$10*N$9*N$13*P55,2),0)+IF(Q55=$Y$7,ROUND(Q$10*Q$9*Q$13*S55,2),0),0)","v":{"$error":"#REF!"}},{"$f":"IF(#REF!=\"X\",IF(H55=$Z$7,ROUND(H$10*H$9*H$13*J55,2),0)+IF(K55=$Z$7,ROUND(K$10*K$9*K$13*M55,2),0)+IF(N55=$Z$7,ROUND(N$10*N$9*N$13*P55,2),0)+IF(Q55=$Z$7,ROUND(Q$10*Q$9*Q$13*S55,2),0),0)","v":{"$error":"#REF!"}},{"$f":"IF(#REF!=\"X\",IF(H55=$AA$7,ROUND(H$10*H$9*H$13*J55,2),0)+IF(K55=$AA$7,ROUND(K$10*K$9*K$13*M55,2),0)+IF(N55=$AA$7,ROUND(N$10*N$9*N$13*P55,2),0)+IF(Q55=$AA$7,ROUND(Q$10*Q$9*Q$13*S55,2),0),0)","v":{"$error":"#REF!"}},{"$f":"IF(#REF!=\"X\",IF(H55=$AB$7,ROUND(H$10*H$9*H$13*J55,2),0)+IF(K55=$AB$7,ROUND(K$10*K$9*K$13*M55,2),0)+IF(N55=$AB$7,ROUND(N$10*N$9*N$13*P55,2),0)+IF(Q55=$AB$7,ROUND(Q$10*Q$9*Q$13*S55,2),0),0)","v":{"$error":"#REF!"}},{"$f":"IF(#REF!=\"X\",IF(H55=$AC$7,ROUND(H$10*H$9*H$13*J55,2),0)+IF(K55=$AC$7,ROUND(K$10*K$9*K$13*M55,2),0)+IF(N55=$AC$7,ROUND(N$10*N$9*N$13*P55,2),0)+IF(Q55=$AC$7,ROUND(Q$10*Q$9*Q$13*S55,2),0),0)","v":{"$error":"#REF!"}},{"$f":"IF(#REF!=\"X\",IF(H55=$AD$7,ROUND(H$10*H$9*H$13*J55,2),0)+IF(K55=$AD$7,ROUND(K$10*K$9*K$13*M55,2),0)+IF(N55=$AD$7,ROUND(N$10*N$9*N$13*P55,2),0)+IF(Q55=$AD$7,ROUND(Q$10*Q$9*Q$13*S55,2),0),0)","v":{"$error":"#REF!"}},{"$nulls":3},"X"]
[1,{"$nulls":4},"QbII.19\nQps.16"," Diagnosi e qualificazione energetica degli edifici esistenti (d.P.R. 59), esclusi i rilievi e le indagini  ",{"$f":"IF(AND('Calcolo DM 140-12 + ORD. 108-20'!I69<9,'Calcolo DM 140-12 + ORD. 108-20'!I69>0),\"X\",\"\")","v":""},{"v":0,"d":"0.000"},{"v":0.02,"d":"0.020"},{"$f":"IF(AND('Calcolo DM 140-12 + ORD. 108-20'!L69<9,'Calcolo DM 140-12 + ORD. 108-20'!L69>0),\"X\",\"\")","v":""},{"v":0,"d":"0.000"},{"v":0.02,"d":"0.020"},{"$f":"IF(AND('Calcolo DM 140-12 + ORD. 108-20'!O69<9,'Calcolo DM 140-12 + ORD. 108-20'!O69>0),\"X\",\"\")","v":""},{"v":0,"d":"0.000"},{"v":0.02,"d":"0.020"},{"$f":"IF(AND('Calcolo DM 140-12 + ORD. 108-20'!R69<9,'Calcolo DM 140-12 + ORD. 108-20'!R69>0),\"X\",\"\")","v":""},{"v":0,"d":"0.000"},{"v":0.02,"d":"0.020"},{"$nulls":3},{"$f":"IF(#REF!=\"X\",IF(H56=$W$7,ROUND(H$10*H$9*H$13*J56,2),0)+IF(K56=$W$7,ROUND(K$10*K$9*K$13*M56,2),0)+IF(N56=$W$7,ROUND(N$10*N$9*N$13*P56,2),0)+IF(Q56=$W$7,ROUND(Q$10*Q$9*Q$13*S56,2),0),0)","v":{"$error":"#REF!"}},{"$f":"IF(#REF!=\"X\",IF(H56=$X$7,ROUND(H$10*H$9*H$13*J56,2),0)+IF(K56=$X$7,ROUND(K$10*K$9*K$13*M56,2),0)+IF(N56=$X$7,ROUND(N$10*N$9*N$13*P56,2),0)+IF(Q56=$X$7,ROUND(Q$10*Q$9*Q$13*S56,2),0),0)","v":{"$error":"#REF!"}},{"$f":"IF(#REF!=\"X\",IF(H56=$Y$7,ROUND(H$10*H$9*H$13*J56,2),0)+IF(K56=$Y$7,ROUND(K$10*K$9*K$13*M56,2),0)+IF(N56=$Y$7,ROUND(N$10*N$9*N$13*P56,2),0)+IF(Q56=$Y$7,ROUND(Q$10*Q$9*Q$13*S56,2),0),0)","v":{"$error":"#REF!"}},{"$f":"IF(#REF!=\"X\",IF(H56=$Z$7,ROUND(H$10*H$9*H$13*J56,2),0)+IF(K56=$Z$7,ROUND(K$10*K$9*K$13*M56,2),0)+IF(N56=$Z$7,ROUND(N$10*N$9*N$13*P56,2),0)+IF(Q56=$Z$7,ROUND(Q$10*Q$9*Q$13*S56,2),0),0)","v":{"$error":"#REF!"}},{"$f":"IF(#REF!=\"X\",IF(H56=$AA$7,ROUND(H$10*H$9*H$13*J56,2),0)+IF(K56=$AA$7,ROUND(K$10*K$9*K$13*M56,2),0)+IF(N56=$AA$7,ROUND(N$10*N$9*N$13*P56,2),0)+IF(Q56=$AA$7,ROUND(Q$10*Q$9*Q$13*S56,2),0),0)","v":{"$error":"#REF!"}},{"$f":"IF(#REF!=\"X\",IF(H56=$AB$7,ROUND(H$10*H$9*H$13*J56,2),0)+IF(K56=$AB$7,ROUND(K$10*K$9*K$13*M56,2),0)+IF(N56=$AB$7,ROUND(N$10*N$9*N$13*P56,2),0)+IF(Q56=$AB$7,ROUND(Q$10*Q$9*Q$13*S56,2),0),0)","v":{"$error":"#REF!"}},{"$f":"IF(#REF!=\"X\",IF(H56=$AC$7,ROUND(H$10*H$9*H$13*J56,2),0)+IF(K56=$AC$7,ROUND(K$10*K$9*K$13*M56,2),0)+IF(N56=$AC$7,ROUND(N$10*N$9*N$13*P56,2),0)+IF(Q56=$AC$7,ROUND(Q$10*Q$9*Q$13*S56,2),0),0)","v":{"$error":"#REF!"}},{"$f":"IF(#REF!=\"X\",IF(H56=$AD$7,ROUND(H$10*H$9*H$13*J56,2),0)+IF(K56=$AD$7,ROUND(K$10*K$9*K$13*M56,2),0)+IF(N56=$AD$7,ROUND(N$10*N$9*N$13*P56,2),0)+IF(Q56=$AD$7,ROUND(Q$10*Q$9*Q$13*S56,2),0),0)","v":{"$error":"#REF!"}},{"$nulls":4},"X"]
[1,{"$nulls":4},"QbII.20\nQS.01.02"," Aggiornamento delle prime indicazioni e prescrizioni per la redazione del PSC  ",{"$f":"IF(AND('Calcolo DM 140-12 + ORD. 108-20'!I70<9,'Calcolo DM 140-12 + ORD. 108-20'!I70>0),\"X\",\"\")","v":""},{"v":0,"d":"0.000"},{"v":0.01,"d":"0.010"},{"$f":"IF(AND('Calcolo DM 140-12 + ORD. 108-20'!L70<9,'Calcolo DM 140-12 + ORD. 108-20'!L70>0),\"X\",\"\")","v":""},{"v":0,"d":"0.000"},{"v":0.01,"d":"0.010"},{"$f":"IF(AND('Calcolo DM 140-12 + ORD. 108-20'!O70<9,'Calcolo DM 140-12 + ORD. 108-20'!O70>0),\"X\",\"\")","v":""},{"v":0,"d":"0.000"},{"v":0.01,"d":"0.010"},{"$f":"IF(AND('Calcolo DM 140-12 + ORD. 108-20'!R70<9,'Calcolo DM 140-12 + ORD. 108-20'!R70>0),\"X\",\"\")","v":""},{"v":0,"d":"0.000"},{"v":0.01,"d":"0.010"},{"$nulls":3},{"$f":"IF(#REF!=\"X\",IF(H57=$W$7,ROUND(H$10*H$9*H$13*J57,2),0)+IF(K57=$W$7,ROUND(K$10*K$9*K$13*M57,2),0)+IF(N57=$W$7,ROUND(N$10*N$9*N$13*P57,2),0)+IF(Q57=$W$7,ROUND(Q$10*Q$9*Q$13*S57,2),0),0)","v":{"$error":"#REF!"}},{"$f":"IF(#REF!=\"X\",IF(H57=$X$7,ROUND(H$10*H$9*H$13*J57,2),0)+IF(K57=$X$7,ROUND(K$10*K$9*K$13*M57,2),0)+IF(N57=$X$7,ROUND(N$10*N$9*N$13*P57,2),0)+IF(Q57=$X$7,ROUND(Q$10*Q$9*Q$13*S57,2),0),0)","v":{"$error":"#REF!"}},{"$f":"IF(#REF!=\"X\",IF(H57=$Y$7,ROUND(H$10*H$9*H$13*J57,2),0)+IF(K57=$Y$7,ROUND(K$10*K$9*K$13*M57,2),0)+IF(N57=$Y$7,ROUND(N$10*N$9*N$13*P57,2),0)+IF(Q57=$Y$7,ROUND(Q$10*Q$9*Q$13*S57,2),0),0)","v":{"$error":"#REF!"}},{"$f":"IF(#REF!=\"X\",IF(H57=$Z$7,ROUND(H$10*H$9*H$13*J57,2),0)+IF(K57=$Z$7,ROUND(K$10*K$9*K$13*M57,2),0)+IF(N57=$Z$7,ROUND(N$10*N$9*N$13*P57,2),0)+IF(Q57=$Z$7,ROUND(Q$10*Q$9*Q$13*S57,2),0),0)","v":{"$error":"#REF!"}},{"$f":"IF(#REF!=\"X\",IF(H57=$AA$7,ROUND(H$10*H$9*H$13*J57,2),0)+IF(K57=$AA$7,ROUND(K$10*K$9*K$13*M57,2),0)+IF(N57=$AA$7,ROUND(N$10*N$9*N$13*P57,2),0)+IF(Q57=$AA$7,ROUND(Q$10*Q$9*Q$13*S57,2),0),0)","v":{"$error":"#REF!"}},{"$f":"IF(#REF!=\"X\",IF(H57=$AB$7,ROUND(H$10*H$9*H$13*J57,2),0)+IF(K57=$AB$7,ROUND(K$10*K$9*K$13*M57,2),0)+IF(N57=$AB$7,ROUND(N$10*N$9*N$13*P57,2),0)+IF(Q57=$AB$7,ROUND(Q$10*Q$9*Q$13*S57,2),0),0)","v":{"$error":"#REF!"}},{"$f":"IF(#REF!=\"X\",IF(H57=$AC$7,ROUND(H$10*H$9*H$13*J57,2),0)+IF(K57=$AC$7,ROUND(K$10*K$9*K$13*M57,2),0)+IF(N57=$AC$7,ROUND(N$10*N$9*N$13*P57,2),0)+IF(Q57=$AC$7,ROUND(Q$10*Q$9*Q$13*S57,2),0),0)","v":{"$error":"#REF!"}},{"$f":"IF(#REF!=\"X\",IF(H57=$AD$7,ROUND(H$10*H$9*H$13*J57,2),0)+IF(K57=$AD$7,ROUND(K$10*K$9*K$13*M57,2),0)+IF(N57=$AD$7,ROUND(N$10*N$9*N$13*P57,2),0)+IF(Q57=$AD$7,ROUND(Q$10*Q$9*Q$13*S57,2),0),0)","v":{"$error":"#REF!"}}]
[1,{"$nulls":4}," QbII.21  "," Studio di impatto ambientale o di fattibilita ambientale (VIA\u0081]VAS\u0081]AIA) . Indagini alimentari ed analisi predittive di sicurezza alimentare  ",{"$f":"IF(AND('Calcolo DM 140-12 + ORD. 108-20'!I71<9,'Calcolo DM 140-12 + ORD. 108-20'!I71>0),\"X\",\"\")","v":""},{"v":0,"d":"0.000"},{"v":0.15,"d":"0.150"},{"$f":"IF(AND('Calcolo DM 140-12 + ORD. 108-20'!L71<9,'Calcolo DM 140-12 + ORD. 108-20'!L71>0),\"X\",\"\")","v":""},{"v":0,"d":"0.000"},{"v":0.12,"d":"0.120"},{"$f":"IF(AND('Calcolo DM 140-12 + ORD. 108-20'!O71<9,'Calcolo DM 140-12 + ORD. 108-20'!O71>0),\"X\",\"\")","v":""},{"v":0,"d":"0.000"},{"v":0.19,"d":"0.190"},{"$f":"IF(AND('Calcolo DM 140-12 + ORD. 108-20'!R71<9,'Calcolo DM 140-12 + ORD. 108-20'!R71>0),\"X\",\"\")","v":""},{"v":0,"d":"0.000"},{"v":0.19,"d":"0.190"},{"$nulls":3},{"$f":"IF(#REF!=\"X\",IF(H58=$W$7,ROUND(H$10*H$9*H$13*J58,2),0)+IF(K58=$W$7,ROUND(K$10*K$9*K$13*M58,2),0)+IF(N58=$W$7,ROUND(N$10*N$9*N$13*P58,2),0)+IF(Q58=$W$7,ROUND(Q$10*Q$9*Q$13*S58,2),0),0)","v":{"$error":"#REF!"}},{"$f":"IF(#REF!=\"X\",IF(H58=$X$7,ROUND(H$10*H$9*H$13*J58,2),0)+IF(K58=$X$7,ROUND(K$10*K$9*K$13*M58,2),0)+IF(N58=$X$7,ROUND(N$10*N$9*N$13*P58,2),0)+IF(Q58=$X$7,ROUND(Q$10*Q$9*Q$13*S58,2),0),0)","v":{"$error":"#REF!"}},{"$f":"IF(#REF!=\"X\",IF(H58=$Y$7,ROUND(H$10*H$9*H$13*J58,2),0)+IF(K58=$Y$7,ROUND(K$10*K$9*K$13*M58,2),0)+IF(N58=$Y$7,ROUND(N$10*N$9*N$13*P58,2),0)+IF(Q58=$Y$7,ROUND(Q$10*Q$9*Q$13*S58,2),0),0)","v":{"$error":"#REF!"}},{"$f":"IF(#REF!=\"X\",IF(H58=$Z$7,ROUND(H$10*H$9*H$13*J58,2),0)+IF(K58=$Z$7,ROUND(K$10*K$9*K$13*M58,2),0)+IF(N58=$Z$7,ROUND(N$10*N$9*N$13*P58,2),0)+IF(Q58=$Z$7,ROUND(Q$10*Q$9*Q$13*S58,2),0),0)","v":{"$error":"#REF!"}},{"$f":"IF(#REF!=\"X\",IF(H58=$AA$7,ROUND(H$10*H$9*H$13*J58,2),0)+IF(K58=$AA$7,ROUND(K$10*K$9*K$13*M58,2),0)+IF(N58=$AA$7,ROUND(N$10*N$9*N$13*P58,2),0)+IF(Q58=$AA$7,ROUND(Q$10*Q$9*Q$13*S58,2),0),0)","v":{"$error":"#REF!"}},{"$f":"IF(#REF!=\"X\",IF(H58=$AB$7,ROUND(H$10*H$9*H$13*J58,2),0)+IF(K58=$AB$7,ROUND(K$10*K$9*K$13*M58,2),0)+IF(N58=$AB$7,ROUND(N$10*N$9*N$13*P58,2),0)+IF(Q58=$AB$7,ROUND(Q$10*Q$9*Q$13*S58,2),0),0)","v":{"$error":"#REF!"}},{"$f":"IF(#REF!=\"X\",IF(H58=$AC$7,ROUND(H$10*H$9*H$13*J58,2),0)+IF(K58=$AC$7,ROUND(K$10*K$9*K$13*M58,2),0)+IF(N58=$AC$7,ROUND(N$10*N$9*N$13*P58,2),0)+IF(Q58=$AC$7,ROUND(Q$10*Q$9*Q$13*S58,2),0),0)","v":{"$error":"#REF!"}},{"$f":"IF(#REF!=\"X\",IF(H58=$AD$7,ROUND(H$10*H$9*H$13*J58,2),0)+IF(K58=$AD$7,ROUND(K$10*K$9*K$13*M58,2),0)+IF(N58=$AD$7,ROUND(N$10*N$9*N$13*P58,2),0)+IF(Q58=$AD$7,ROUND(Q$10*Q$9*Q$13*S58,2),0),0)","v":{"$error":"#REF!"}}]
[{"$f":"IF(OR(J59<>0,M59<>0,P59<>0,S59<>0),\"\",1)","v":1},"totale incidenze",{"$nulls":3},"∑ Q i",null,null,{"$f":"SUM(I38:I58)","v":{"v":0,"d":"0.000"}},{"$f":"I59","v":{"v":0,"d":"0.000"}},null,{"$f":"SUM(L38:L58)","v":{"v":0,"d":"0.000"}},{"$f":"L59","v":{"v":0,"d":"0.000"}},null,{"$f":"SUM(O38:O58)","v":{"v":0,"d":"0.000"}},{"$f":"O59","v":{"v":0,"d":"0.000"}},null,{"$f":"SUM(R38:R58)","v":{"v":0,"d":"0.000"}},{"$f":"R59","v":{"v":0,"d":"0.000"}},{"$nulls":12},{"$f":"H61-SUM(W38:AD58)","v":{"$error":"#REF!"}}]
[{"$f":"IF(OR(H60<>0,K60<>0,N60<>0,Q60<>0),\"\",1)","v":1},"Compenso al netto di spese ed oneri CNPAIA ",{"$nulls":3},"V*P*G*ΣQ",null,{"$f":"J59*H9*H10*H13","v":{"v":0,"d":"0.00 €"}},null,null,{"$f":"M59*K9*K10*K13","v":{"v":0,"d":"0.00 €"}},null,null,{"$f":"P59*N9*N10*N13","v":{"v":0,"d":"0.00 €"}},null,null,{"$f":"S59*Q9*Q10*Q13","v":{"v":0,"d":"0.00 €"}},{"$nulls":3},"eventuale aggiustamento\ndx-sx",null,{"$f":"AF59","v":{"$error":"#REF!"}}]
[null,"COMPENSO AL NETTO DELLE SPESE",{"$nulls":5},{"$f":"ROUND(SUM(H60:S60),2)","v":{"v":0,"d":"0.00 €"}},{"$nulls":12},{"$f":"IF(H61=SUM(W61:AD61),\"OK\",\"CONTROLLA\")","v":{"$error":"#REF!"}},{"$f":"SUM(W61:AD61)-H61","v":{"$error":"#REF!"}},{"$f":"SUM(W38:W60)","v":{"$error":"#REF!"}},{"$f":"SUM(X38:X60)","v":{"$error":"#REF!"}},{"$f":"SUM(Y38:Y60)","v":{"$error":"#REF!"}},{"$f":"SUM(Z38:Z60)","v":{"$error":"#REF!"}},{"$error":"#REF!"},{"$error":"#REF!"},{"$error":"#REF!"},{"$error":"#REF!"}]
[]
[null,"PROGETTAZIONE ESECUTIVA",{"$nulls":5},"Edilizia",null,null,"Strutture",null,null,"Impianto Elettrico",null,null,"Impianto Termo-Idrau",{"$nulls":5},"PROGETTAZIONE ESECUTIVA"]
[{"$f":"IF(OR(H64<>\"\",K64<>\"\",N64<>\"\",Q64<>\"\"),\"\",1)","v":1},"PROGETTAZIONE"," b.III) PROGETTAZIONE ESECUTIVA  ","prestazioni affidate","incidenza Q","QbIII.01\nQpe.01"," Relazione generale e specialistiche, Elaborati grafici, Calcoli esecutivi (art.33, comma 1, lettere a), b), c), d), d.P.R. 207/10)",{"$f":"IF(AND('Calcolo DM 140-12 + ORD. 108-20'!I77<9,'Calcolo DM 140-12 + ORD. 108-20'!I77>0),\"X\",\"\")","v":""},{"$f":"IF(H64=\"X\",J64,0)","v":{"v":0,"d":"0.000"}},{"v":0.1,"d":"0.100"},{"$f":"IF(AND('Calcolo DM 140-12 + ORD. 108-20'!L77<9,'Calcolo DM 140-12 + ORD. 108-20'!L77>0),\"X\",\"\")","v":""},{"$f":"IF(K64=\"X\",M64,0)","v":{"v":0,"d":"0.000"}},{"v":0.12,"d":"0.120"},{"$f":"IF(AND('Calcolo DM 140-12 + ORD. 108-20'!O77<9,'Calcolo DM 140-12 + ORD. 108-20'!O77>0),\"X\",\"\")","v":""},{"$f":"IF(N64=\"X\",P64,0)","v":{"v":0,"d":"0.000"}},{"v":0.15,"d":"0.150"},{"$f":"IF(AND('Calcolo DM 140-12 + ORD. 108-20'!R77<9,'Calcolo DM 140-12 + ORD. 108-20'!R77>0),\"X\",\"\")","v":""},{"$f":"IF(Q64=\"X\",S64,0)","v":{"v":0,"d":"0.000"}},{"v":0.15,"d":"0.150"},{"$nulls":3},{"$f":"IF(#REF!=\"X\",IF(H64=$W$7,ROUND(H$10*H$9*H$13*J64,2),0)+IF(K64=$W$7,ROUND(K$10*K$9*K$13*M64,2),0)+IF(N64=$W$7,ROUND(N$10*N$9*N$13*P64,2),0)+IF(Q64=$W$7,ROUND(Q$10*Q$9*Q$13*S64,2),0),0)","v":{"$error":"#REF!"}},{"$f":"IF(#REF!=\"X\",IF(H64=$X$7,ROUND(H$10*H$9*H$13*J64,2),0)+IF(K64=$X$7,ROUND(K$10*K$9*K$13*M64,2),0)+IF(N64=$X$7,ROUND(N$10*N$9*N$13*P64,2),0)+IF(Q64=$X$7,ROUND(Q$10*Q$9*Q$13*S64,2),0),0)","v":{"$error":"#REF!"}},{"$f":"IF(#REF!=\"X\",IF(H64=$Y$7,ROUND(H$10*H$9*H$13*J64,2),0)+IF(K64=$Y$7,ROUND(K$10*K$9*K$13*M64,2),0)+IF(N64=$Y$7,ROUND(N$10*N$9*N$13*P64,2),0)+IF(Q64=$Y$7,ROUND(Q$10*Q$9*Q$13*S64,2),0),0)","v":{"$error":"#REF!"}},{"$f":"IF(#REF!=\"X\",IF(H64=$Z$7,ROUND(H$10*H$9*H$13*J64,2),0)+IF(K64=$Z$7,ROUND(K$10*K$9*K$13*M64,2),0)+IF(N64=$Z$7,ROUND(N$10*N$9*N$13*P64,2),0)+IF(Q64=$Z$7,ROUND(Q$10*Q$9*Q$13*S64,2),0),0)","v":{"$error":"#REF!"}},{"$f":"IF(#REF!=\"X\",IF(H64=$AA$7,ROUND(H$10*H$9*H$13*J64,2),0)+IF(K64=$AA$7,ROUND(K$10*K$9*K$13*M64,2),0)+IF(N64=$AA$7,ROUND(N$10*N$9*N$13*P64,2),0)+IF(Q64=$AA$7,ROUND(Q$10*Q$9*Q$13*S64,2),0),0)","v":{"$error":"#REF!"}},{"$f":"IF(#REF!=\"X\",IF(H64=$AB$7,ROUND(H$10*H$9*H$13*J64,2),0)+IF(K64=$AB$7,ROUND(K$10*K$9*K$13*M64,2),0)+IF(N64=$AB$7,ROUND(N$10*N$9*N$13*P64,2),0)+IF(Q64=$AB$7,ROUND(Q$10*Q$9*Q$13*S64,2),0),0)","v":{"$error":"#REF!"}},{"$f":"IF(#REF!=\"X\",IF(H64=$AC$7,ROUND(H$10*H$9*H$13*J64,2),0)+IF(K64=$AC$7,ROUND(K$10*K$9*K$13*M64,2),0)+IF(N64=$AC$7,ROUND(N$10*N$9*N$13*P64,2),0)+IF(Q64=$AC$7,ROUND(Q$10*Q$9*Q$13*S64,2),0),0)","v":{"$error":"#REF!"}},{"$f":"IF(#REF!=\"X\",IF(H64=$AD$7,ROUND(H$10*H$9*H$13*J64,2),0)+IF(K64=$AD$7,ROUND(K$10*K$9*K$13*M64,2),0)+IF(N64=$AD$7,ROUND(N$10*N$9*N$13*P64,2),0)+IF(Q64=$AD$7,ROUND(Q$10*Q$9*Q$13*S64,2),0),0)","v":{"$error":"#REF!"}},{"$nulls":3},"X","X","X","X"]
[1,{"$nulls":4},"QbIII.02\nQpe.02"," Particolari costruttivi e decorativi (art.36, comma 1, lettera c), d.P.R. 207/10)  ",{"$f":"IF(AND('Calcolo DM 140-12 + ORD. 108-20'!I78<9,'Calcolo DM 140-12 + ORD. 108-20'!I78>0),\"X\",\"\")","v":""},{"v":0,"d":"0.000"},{"v":0.13,"d":"0.130"},{"$f":"IF(AND('Calcolo DM 140-12 + ORD. 108-20'!L78<9,'Calcolo DM 140-12 + ORD. 108-20'!L78>0),\"X\",\"\")","v":""},{"v":0,"d":"0.000"},{"v":0.13,"d":"0.130"},{"$f":"IF(AND('Calcolo DM 140-12 + ORD. 108-20'!O78<9,'Calcolo DM 140-12 + ORD. 108-20'!O78>0),\"X\",\"\")","v":""},{"v":0,"d":"0.000"},{"v":0.05,"d":"0.050"},{"$f":"IF(AND('Calcolo DM 140-12 + ORD. 108-20'!R78<9,'Calcolo DM 140-12 + ORD. 108-20'!R78>0),\"X\",\"\")","v":""},{"v":0,"d":"0.000"},{"v":0.05,"d":"0.050"},{"$nulls":3},{"$f":"IF(#REF!=\"X\",IF(H65=$W$7,ROUND(H$10*H$9*H$13*J65,2),0)+IF(K65=$W$7,ROUND(K$10*K$9*K$13*M65,2),0)+IF(N65=$W$7,ROUND(N$10*N$9*N$13*P65,2),0)+IF(Q65=$W$7,ROUND(Q$10*Q$9*Q$13*S65,2),0),0)","v":{"$error":"#REF!"}},{"$f":"IF(#REF!=\"X\",IF(H65=$X$7,ROUND(H$10*H$9*H$13*J65,2),0)+IF(K65=$X$7,ROUND(K$10*K$9*K$13*M65,2),0)+IF(N65=$X$7,ROUND(N$10*N$9*N$13*P65,2),0)+IF(Q65=$X$7,ROUND(Q$10*Q$9*Q$13*S65,2),0),0)","v":{"$error":"#REF!"}},{"$f":"IF(#REF!=\"X\",IF(H65=$Y$7,ROUND(H$10*H$9*H$13*J65,2),0)+IF(K65=$Y$7,ROUND(K$10*K$9*K$13*M65,2),0)+IF(N65=$Y$7,ROUND(N$10*N$9*N$13*P65,2),0)+IF(Q65=$Y$7,ROUND(Q$10*Q$9*Q$13*S65,2),0),0)","v":{"$error":"#REF!"}},{"$f":"IF(#REF!=\"X\",IF(H65=$Z$7,ROUND(H$10*H$9*H$13*J65,2),0)+IF(K65=$Z$7,ROUND(K$10*K$9*K$13*M65,2),0)+IF(N65=$Z$7,ROUND(N$10*N$9*N$13*P65,2),0)+IF(Q65=$Z$7,ROUND(Q$10*Q$9*Q$13*S65,2),0),0)","v":{"$error":"#REF!"}},{"$f":"IF(#REF!=\"X\",IF(H65=$AA$7,ROUND(H$10*H$9*H$13*J65,2),0)+IF(K65=$AA$7,ROUND(K$10*K$9*K$13*M65,2),0)+IF(N65=$AA$7,ROUND(N$10*N$9*N$13*P65,2),0)+IF(Q65=$AA$7,ROUND(Q$10*Q$9*Q$13*S65,2),0),0)","v":{"$error":"#REF!"}},{"$f":"IF(#REF!=\"X\",IF(H65=$AB$7,ROUND(H$10*H$9*H$13*J65,2),0)+IF(K65=$AB$7,ROUND(K$10*K$9*K$13*M65,2),0)+IF(N65=$AB$7,ROUND(N$10*N$9*N$13*P65,2),0)+IF(Q65=$AB$7,ROUND(Q$10*Q$9*Q$13*S65,2),0),0)","v":{"$error":"#REF!"}},{"$f":"IF(#REF!=\"X\",IF(H65=$AC$7,ROUND(H$10*H$9*H$13*J65,2),0)+IF(K65=$AC$7,ROUND(K$10*K$9*K$13*M65,2),0)+IF(N65=$AC$7,ROUND(N$10*N$9*N$13*P65,2),0)+IF(Q65=$AC$7,ROUND(Q$10*Q$9*Q$13*S65,2),0),0)","v":{"$error":"#REF!"}},{"$f":"IF(#REF!=\"X\",IF(H65=$AD$7,ROUND(H$10*H$9*H$13*J65,2),0)+IF(K65=$AD$7,ROUND(K$10*K$9*K$13*M65,2),0)+IF(N65=$AD$7,ROUND(N$10*N$9*N$13*P65,2),0)+IF(Q65=$AD$7,ROUND(Q$10*Q$9*Q$13*S65,2),0),0)","v":{"$error":"#REF!"}},{"$nulls":3},"X","X","X","X"]
[1,{"$nulls":4},"QbIII.03\nQpe.03"," Computo metrico estimativo, Quadro economico, Elenco prezzi e eventuale analisi, Quadro dell'incidenza percentuale della quantita di manodopera (art.33, comma 1, lettere f), g), i), d.P.R. 207/10)  ",{"$f":"IF(AND('Calcolo DM 140-12 + ORD. 108-20'!I79<9,'Calcolo DM 140-12 + ORD. 108-20'!I79>0),\"X\",\"\")","v":""},{"v":0,"d":"0.000"},{"v":0.04,"d":"0.040"},{"$f":"IF(AND('Calcolo DM 140-12 + ORD. 108-20'!L79<9,'Calcolo DM 140-12 + ORD. 108-20'!L79>0),\"X\",\"\")","v":""},{"v":0,"d":"0.000"},{"v":0.03,"d":"0.030"},{"$f":"IF(AND('Calcolo DM 140-12 + ORD. 108-20'!O79<9,'Calcolo DM 140-12 + ORD. 108-20'!O79>0),\"X\",\"\")","v":""},{"v":0,"d":"0.000"},{"v":0.05,"d":"0.050"},{"$f":"IF(AND('Calcolo DM 140-12 + ORD. 108-20'!R79<9,'Calcolo DM 140-12 + ORD. 108-20'!R79>0),\"X\",\"\")","v":""},{"v":0,"d":"0.000"},{"v":0.05,"d":"0.050"},{"$nulls":3},{"$f":"IF(#REF!=\"X\",IF(H66=$W$7,ROUND(H$10*H$9*H$13*J66,2),0)+IF(K66=$W$7,ROUND(K$10*K$9*K$13*M66,2),0)+IF(N66=$W$7,ROUND(N$10*N$9*N$13*P66,2),0)+IF(Q66=$W$7,ROUND(Q$10*Q$9*Q$13*S66,2),0),0)","v":{"$error":"#REF!"}},{"$f":"IF(#REF!=\"X\",IF(H66=$X$7,ROUND(H$10*H$9*H$13*J66,2),0)+IF(K66=$X$7,ROUND(K$10*K$9*K$13*M66,2),0)+IF(N66=$X$7,ROUND(N$10*N$9*N$13*P66,2),0)+IF(Q66=$X$7,ROUND(Q$10*Q$9*Q$13*S66,2),0),0)","v":{"$error":"#REF!"}},{"$f":"IF(#REF!=\"X\",IF(H66=$Y$7,ROUND(H$10*H$9*H$13*J66,2),0)+IF(K66=$Y$7,ROUND(K$10*K$9*K$13*M66,2),0)+IF(N66=$Y$7,ROUND(N$10*N$9*N$13*P66,2),0)+IF(Q66=$Y$7,ROUND(Q$10*Q$9*Q$13*S66,2),0),0)","v":{"$error":"#REF!"}},{"$f":"IF(#REF!=\"X\",IF(H66=$Z$7,ROUND(H$10*H$9*H$13*J66,2),0)+IF(K66=$Z$7,ROUND(K$10*K$9*K$13*M66,2),0)+IF(N66=$Z$7,ROUND(N$10*N$9*N$13*P66,2),0)+IF(Q66=$Z$7,ROUND(Q$10*Q$9*Q$13*S66,2),0),0)","v":{"$error":"#REF!"}},{"$f":"IF(#REF!=\"X\",IF(H66=$AA$7,ROUND(H$10*H$9*H$13*J66,2),0)+IF(K66=$AA$7,ROUND(K$10*K$9*K$13*M66,2),0)+IF(N66=$AA$7,ROUND(N$10*N$9*N$13*P66,2),0)+IF(Q66=$AA$7,ROUND(Q$10*Q$9*Q$13*S66,2),0),0)","v":{"$error":"#REF!"}},{"$f":"IF(#REF!=\"X\",IF(H66=$AB$7,ROUND(H$10*H$9*H$13*J66,2),0)+IF(K66=$AB$7,ROUND(K$10*K$9*K$13*M66,2),0)+IF(N66=$AB$7,ROUND(N$10*N$9*N$13*P66,2),0)+IF(Q66=$AB$7,ROUND(Q$10*Q$9*Q$13*S66,2),0),0)","v":{"$error":"#REF!"}},{"$f":"IF(#REF!=\"X\",IF(H66=$AC$7,ROUND(H$10*H$9*H$13*J66,2),0)+IF(K66=$AC$7,ROUND(K$10*K$9*K$13*M66,2),0)+IF(N66=$AC$7,ROUND(N$10*N$9*N$13*P66,2),0)+IF(Q66=$AC$7,ROUND(Q$10*Q$9*Q$13*S66,2),0),0)","v":{"$error":"#REF!"}},{"$f":"IF(#REF!=\"X\",IF(H66=$AD$7,ROUND(H$10*H$9*H$13*J66,2),0)+IF(K66=$AD$7,ROUND(K$10*K$9*K$13*M66,2),0)+IF(N66=$AD$7,ROUND(N$10*N$9*N$13*P66,2),0)+IF(Q66=$AD$7,ROUND(Q$10*Q$9*Q$13*S66,2),0),0)","v":{"$error":"#REF!"}},{"$nulls":3},"X","X","X","X"]
[1,{"$nulls":4},"QbIII.04\nQpe.04.02"," Schema di contratto, capitolato speciale d'appalto, cronoprogramma (art.33, comma 1, lettere l), h), d.P.R. 207/10)  ",{"$f":"IF(AND('Calcolo DM 140-12 + ORD. 108-20'!I80<9,'Calcolo DM 140-12 + ORD. 108-20'!I80>0),\"X\",\"\")","v":""},{"v":0,"d":"0.000"},{"v":0.02,"d":"0.020"},{"$f":"IF(AND('Calcolo DM 140-12 + ORD. 108-20'!L80<9,'Calcolo DM 140-12 + ORD. 108-20'!L80>0),\"X\",\"\")","v":""},{"v":0,"d":"0.000"},{"v":0.01,"d":"0.010"},{"$f":"IF(AND('Calcolo DM 140-12 + ORD. 108-20'!O80<9,'Calcolo DM 140-12 + ORD. 108-20'!O80>0),\"X\",\"\")","v":""},{"v":0,"d":"0.000"},{"v":0.02,"d":"0.020"},{"$f":"IF(AND('Calcolo DM 140-12 + ORD. 108-20'!R80<9,'Calcolo DM 140-12 + ORD. 108-20'!R80>0),\"X\",\"\")","v":""},{"v":0,"d":"0.000"},{"v":0.02,"d":"0.020"},{"$nulls":3},{"$f":"IF(#REF!=\"X\",IF(H67=$W$7,ROUND(H$10*H$9*H$13*J67,2),0)+IF(K67=$W$7,ROUND(K$10*K$9*K$13*M67,2),0)+IF(N67=$W$7,ROUND(N$10*N$9*N$13*P67,2),0)+IF(Q67=$W$7,ROUND(Q$10*Q$9*Q$13*S67,2),0),0)","v":{"$error":"#REF!"}},{"$f":"IF(#REF!=\"X\",IF(H67=$X$7,ROUND(H$10*H$9*H$13*J67,2),0)+IF(K67=$X$7,ROUND(K$10*K$9*K$13*M67,2),0)+IF(N67=$X$7,ROUND(N$10*N$9*N$13*P67,2),0)+IF(Q67=$X$7,ROUND(Q$10*Q$9*Q$13*S67,2),0),0)","v":{"$error":"#REF!"}},{"$f":"IF(#REF!=\"X\",IF(H67=$Y$7,ROUND(H$10*H$9*H$13*J67,2),0)+IF(K67=$Y$7,ROUND(K$10*K$9*K$13*M67,2),0)+IF(N67=$Y$7,ROUND(N$10*N$9*N$13*P67,2),0)+IF(Q67=$Y$7,ROUND(Q$10*Q$9*Q$13*S67,2),0),0)","v":{"$error":"#REF!"}},{"$f":"IF(#REF!=\"X\",IF(H67=$Z$7,ROUND(H$10*H$9*H$13*J67,2),0)+IF(K67=$Z$7,ROUND(K$10*K$9*K$13*M67,2),0)+IF(N67=$Z$7,ROUND(N$10*N$9*N$13*P67,2),0)+IF(Q67=$Z$7,ROUND(Q$10*Q$9*Q$13*S67,2),0),0)","v":{"$error":"#REF!"}},{"$f":"IF(#REF!=\"X\",IF(H67=$AA$7,ROUND(H$10*H$9*H$13*J67,2),0)+IF(K67=$AA$7,ROUND(K$10*K$9*K$13*M67,2),0)+IF(N67=$AA$7,ROUND(N$10*N$9*N$13*P67,2),0)+IF(Q67=$AA$7,ROUND(Q$10*Q$9*Q$13*S67,2),0),0)","v":{"$error":"#REF!"}},{"$f":"IF(#REF!=\"X\",IF(H67=$AB$7,ROUND(H$10*H$9*H$13*J67,2),0)+IF(K67=$AB$7,ROUND(K$10*K$9*K$13*M67,2),0)+IF(N67=$AB$7,ROUND(N$10*N$9*N$13*P67,2),0)+IF(Q67=$AB$7,ROUND(Q$10*Q$9*Q$13*S67,2),0),0)","v":{"$error":"#REF!"}},{"$f":"IF(#REF!=\"X\",IF(H67=$AC$7,ROUND(H$10*H$9*H$13*J67,2),0)+IF(K67=$AC$7,ROUND(K$10*K$9*K$13*M67,2),0)+IF(N67=$AC$7,ROUND(N$10*N$9*N$13*P67,2),0)+IF(Q67=$AC$7,ROUND(Q$10*Q$9*Q$13*S67,2),0),0)","v":{"$error":"#REF!"}},{"$f":"IF(#REF!=\"X\",IF(H67=$AD$7,ROUND(H$10*H$9*H$13*J67,2),0)+IF(K67=$AD$7,ROUND(K$10*K$9*K$13*M67,2),0)+IF(N67=$AD$7,ROUND(N$10*N$9*N$13*P67,2),0)+IF(Q67=$AD$7,ROUND(Q$10*Q$9*Q$13*S67,2),0),0)","v":{"$error":"#REF!"}},{"$nulls":3},"X","X","X","X"]
[1,{"$nulls":4},"QbIII.05\nQpe.05"," Piano di manutenzione dell'opera (art.33, comma 1, lettera e) d.P.R. 207/10)  ",{"$f":"IF(AND('Calcolo DM 140-12 + ORD. 108-20'!I81<9,'Calcolo DM 140-12 + ORD. 108-20'!I81>0),\"X\",\"\")","v":""},{"v":0,"d":"0.000"},{"v":0.02,"d":"0.020"},{"$f":"IF(AND('Calcolo DM 140-12 + ORD. 108-20'!L81<9,'Calcolo DM 140-12 + ORD. 108-20'!L81>0),\"X\",\"\")","v":""},{"v":0,"d":"0.000"},0.025,{"$f":"IF(AND('Calcolo DM 140-12 + ORD. 108-20'!O81<9,'Calcolo DM 140-12 + ORD. 108-20'!O81>0),\"X\",\"\")","v":""},{"v":0,"d":"0.000"},{"v":0.03,"d":"0.030"},{"$f":"IF(AND('Calcolo DM 140-12 + ORD. 108-20'!R81<9,'Calcolo DM 140-12 + ORD. 108-20'!R81>0),\"X\",\"\")","v":""},{"v":0,"d":"0.000"},{"v":0.03,"d":"0.030"},{"$nulls":3},{"$f":"IF(#REF!=\"X\",IF(H68=$W$7,ROUND(H$10*H$9*H$13*J68,2),0)+IF(K68=$W$7,ROUND(K$10*K$9*K$13*M68,2),0)+IF(N68=$W$7,ROUND(N$10*N$9*N$13*P68,2),0)+IF(Q68=$W$7,ROUND(Q$10*Q$9*Q$13*S68,2),0),0)","v":{"$error":"#REF!"}},{"$f":"IF(#REF!=\"X\",IF(H68=$X$7,ROUND(H$10*H$9*H$13*J68,2),0)+IF(K68=$X$7,ROUND(K$10*K$9*K$13*M68,2),0)+IF(N68=$X$7,ROUND(N$10*N$9*N$13*P68,2),0)+IF(Q68=$X$7,ROUND(Q$10*Q$9*Q$13*S68,2),0),0)","v":{"$error":"#REF!"}},{"$f":"IF(#REF!=\"X\",IF(H68=$Y$7,ROUND(H$10*H$9*H$13*J68,2),0)+IF(K68=$Y$7,ROUND(K$10*K$9*K$13*M68,2),0)+IF(N68=$Y$7,ROUND(N$10*N$9*N$13*P68,2),0)+IF(Q68=$Y$7,ROUND(Q$10*Q$9*Q$13*S68,2),0),0)","v":{"$error":"#REF!"}},{"$f":"IF(#REF!=\"X\",IF(H68=$Z$7,ROUND(H$10*H$9*H$13*J68,2),0)+IF(K68=$Z$7,ROUND(K$10*K$9*K$13*M68,2),0)+IF(N68=$Z$7,ROUND(N$10*N$9*N$13*P68,2),0)+IF(Q68=$Z$7,ROUND(Q$10*Q$9*Q$13*S68,2),0),0)","v":{"$error":"#REF!"}},{"$f":"IF(#REF!=\"X\",IF(H68=$AA$7,ROUND(H$10*H$9*H$13*J68,2),0)+IF(K68=$AA$7,ROUND(K$10*K$9*K$13*M68,2),0)+IF(N68=$AA$7,ROUND(N$10*N$9*N$13*P68,2),0)+IF(Q68=$AA$7,ROUND(Q$10*Q$9*Q$13*S68,2),0),0)","v":{"$error":"#REF!"}},{"$f":"IF(#REF!=\"X\",IF(H68=$AB$7,ROUND(H$10*H$9*H$13*J68,2),0)+IF(K68=$AB$7,ROUND(K$10*K$9*K$13*M68,2),0)+IF(N68=$AB$7,ROUND(N$10*N$9*N$13*P68,2),0)+IF(Q68=$AB$7,ROUND(Q$10*Q$9*Q$13*S68,2),0),0)","v":{"$error":"#REF!"}},{"$f":"IF(#REF!=\"X\",IF(H68=$AC$7,ROUND(H$10*H$9*H$13*J68,2),0)+IF(K68=$AC$7,ROUND(K$10*K$9*K$13*M68,2),0)+IF(N68=$AC$7,ROUND(N$10*N$9*N$13*P68,2),0)+IF(Q68=$AC$7,ROUND(Q$10*Q$9*Q$13*S68,2),0),0)","v":{"$error":"#REF!"}},{"$f":"IF(#REF!=\"X\",IF(H68=$AD$7,ROUND(H$10*H$9*H$13*J68,2),0)+IF(K68=$AD$7,ROUND(K$10*K$9*K$13*M68,2),0)+IF(N68=$AD$7,ROUND(N$10*N$9*N$13*P68,2),0)+IF(Q68=$AD$7,ROUND(Q$10*Q$9*Q$13*S68,2),0),0)","v":{"$error":"#REF!"}},{"$nulls":3},"X","X","X","X"]
[1,{"$nulls":4},"QbIII.06\nQpe.06"," Progettazione integrale e coordinata, Integrazione delle prestazioni specialistiche (art.90, comma 7, d.lgs. 163/2006)  ",{"$f":"IF(AND('Calcolo DM 140-12 + ORD. 108-20'!I82<9,'Calcolo DM 140-12 + ORD. 108-20'!I82>0),\"X\",\"\")","v":""},{"v":0,"d":"0.000"},{"v":0.05,"d":"0.050"},{"$f":"IF(AND('Calcolo DM 140-12 + ORD. 108-20'!L82<9,'Calcolo DM 140-12 + ORD. 108-20'!L82>0),\"X\",\"\")","v":""},{"v":0,"d":"0.000"},{"v":0.05,"d":"0.050"},{"$f":"IF(AND('Calcolo DM 140-12 + ORD. 108-20'!O82<9,'Calcolo DM 140-12 + ORD. 108-20'!O82>0),\"X\",\"\")","v":""},{"v":0,"d":"0.000"},{"v":0.05,"d":"0.050"},{"$f":"IF(AND('Calcolo DM 140-12 + ORD. 108-20'!R82<9,'Calcolo DM 140-12 + ORD. 108-20'!R82>0),\"X\",\"\")","v":""},{"v":0,"d":"0.000"},{"v":0.05,"d":"0.050"},{"$nulls":3},{"$f":"IF(#REF!=\"X\",IF(H69=$W$7,ROUND(H$10*H$9*H$13*J69,2),0)+IF(K69=$W$7,ROUND(K$10*K$9*K$13*M69,2),0)+IF(N69=$W$7,ROUND(N$10*N$9*N$13*P69,2),0)+IF(Q69=$W$7,ROUND(Q$10*Q$9*Q$13*S69,2),0),0)","v":{"$error":"#REF!"}},{"$f":"IF(#REF!=\"X\",IF(H69=$X$7,ROUND(H$10*H$9*H$13*J69,2),0)+IF(K69=$X$7,ROUND(K$10*K$9*K$13*M69,2),0)+IF(N69=$X$7,ROUND(N$10*N$9*N$13*P69,2),0)+IF(Q69=$X$7,ROUND(Q$10*Q$9*Q$13*S69,2),0),0)","v":{"$error":"#REF!"}},{"$f":"IF(#REF!=\"X\",IF(H69=$Y$7,ROUND(H$10*H$9*H$13*J69,2),0)+IF(K69=$Y$7,ROUND(K$10*K$9*K$13*M69,2),0)+IF(N69=$Y$7,ROUND(N$10*N$9*N$13*P69,2),0)+IF(Q69=$Y$7,ROUND(Q$10*Q$9*Q$13*S69,2),0),0)","v":{"$error":"#REF!"}},{"$f":"IF(#REF!=\"X\",IF(H69=$Z$7,ROUND(H$10*H$9*H$13*J69,2),0)+IF(K69=$Z$7,ROUND(K$10*K$9*K$13*M69,2),0)+IF(N69=$Z$7,ROUND(N$10*N$9*N$13*P69,2),0)+IF(Q69=$Z$7,ROUND(Q$10*Q$9*Q$13*S69,2),0),0)","v":{"$error":"#REF!"}},{"$f":"IF(#REF!=\"X\",IF(H69=$AA$7,ROUND(H$10*H$9*H$13*J69,2),0)+IF(K69=$AA$7,ROUND(K$10*K$9*K$13*M69,2),0)+IF(N69=$AA$7,ROUND(N$10*N$9*N$13*P69,2),0)+IF(Q69=$AA$7,ROUND(Q$10*Q$9*Q$13*S69,2),0),0)","v":{"$error":"#REF!"}},{"$f":"IF(#REF!=\"X\",IF(H69=$AB$7,ROUND(H$10*H$9*H$13*J69,2),0)+IF(K69=$AB$7,ROUND(K$10*K$9*K$13*M69,2),0)+IF(N69=$AB$7,ROUND(N$10*N$9*N$13*P69,2),0)+IF(Q69=$AB$7,ROUND(Q$10*Q$9*Q$13*S69,2),0),0)","v":{"$error":"#REF!"}},{"$f":"IF(#REF!=\"X\",IF(H69=$AC$7,ROUND(H$10*H$9*H$13*J69,2),0)+IF(K69=$AC$7,ROUND(K$10*K$9*K$13*M69,2),0)+IF(N69=$AC$7,ROUND(N$10*N$9*N$13*P69,2),0)+IF(Q69=$AC$7,ROUND(Q$10*Q$9*Q$13*S69,2),0),0)","v":{"$error":"#REF!"}},{"$f":"IF(#REF!=\"X\",IF(H69=$AD$7,ROUND(H$10*H$9*H$13*J69,2),0)+IF(K69=$AD$7,ROUND(K$10*K$9*K$13*M69,2),0)+IF(N69=$AD$7,ROUND(N$10*N$9*N$13*P69,2),0)+IF(Q69=$AD$7,ROUND(Q$10*Q$9*Q$13*S69,2),0),0)","v":{"$error":"#REF!"}},{"$nulls":3},"X","X","X","X"]
[1,{"$nulls":4},"QbIII.07\nQS.01.03"," Piano di Sicurezza e Coordinamento . Piano di sicurezza alimentare  ",{"$f":"IF(AND('Calcolo DM 140-12 + ORD. 108-20'!I83<9,'Calcolo DM 140-12 + ORD. 108-20'!I83>0),\"X\",\"\")","v":""},{"v":0,"d":"0.000"},{"v":0.1,"d":"0.100"},{"$f":"IF(AND('Calcolo DM 140-12 + ORD. 108-20'!L83<9,'Calcolo DM 140-12 + ORD. 108-20'!L83>0),\"X\",\"\")","v":""},{"v":0,"d":"0.000"},{"v":0.1,"d":"0.100"},{"$f":"IF(AND('Calcolo DM 140-12 + ORD. 108-20'!O83<9,'Calcolo DM 140-12 + ORD. 108-20'!O83>0),\"X\",\"\")","v":""},{"v":0,"d":"0.000"},{"v":0.1,"d":"0.100"},{"$f":"IF(AND('Calcolo DM 140-12 + ORD. 108-20'!R83<9,'Calcolo DM 140-12 + ORD. 108-20'!R83>0),\"X\",\"\")","v":""},{"v":0,"d":"0.000"},{"v":0.1,"d":"0.100"},{"$nulls":3},{"$f":"IF(#REF!=\"X\",IF(H70=$W$7,ROUND(H$10*H$9*H$13*J70,2),0)+IF(K70=$W$7,ROUND(K$10*K$9*K$13*M70,2),0)+IF(N70=$W$7,ROUND(N$10*N$9*N$13*P70,2),0)+IF(Q70=$W$7,ROUND(Q$10*Q$9*Q$13*S70,2),0),0)","v":{"$error":"#REF!"}},{"$f":"IF(#REF!=\"X\",IF(H70=$X$7,ROUND(H$10*H$9*H$13*J70,2),0)+IF(K70=$X$7,ROUND(K$10*K$9*K$13*M70,2),0)+IF(N70=$X$7,ROUND(N$10*N$9*N$13*P70,2),0)+IF(Q70=$X$7,ROUND(Q$10*Q$9*Q$13*S70,2),0),0)","v":{"$error":"#REF!"}},{"$f":"IF(#REF!=\"X\",IF(H70=$Y$7,ROUND(H$10*H$9*H$13*J70,2),0)+IF(K70=$Y$7,ROUND(K$10*K$9*K$13*M70,2),0)+IF(N70=$Y$7,ROUND(N$10*N$9*N$13*P70,2),0)+IF(Q70=$Y$7,ROUND(Q$10*Q$9*Q$13*S70,2),0),0)","v":{"$error":"#REF!"}},{"$f":"IF(#REF!=\"X\",IF(H70=$Z$7,ROUND(H$10*H$9*H$13*J70,2),0)+IF(K70=$Z$7,ROUND(K$10*K$9*K$13*M70,2),0)+IF(N70=$Z$7,ROUND(N$10*N$9*N$13*P70,2),0)+IF(Q70=$Z$7,ROUND(Q$10*Q$9*Q$13*S70,2),0),0)","v":{"$error":"#REF!"}},{"$f":"IF(#REF!=\"X\",IF(H70=$AA$7,ROUND(H$10*H$9*H$13*J70,2),0)+IF(K70=$AA$7,ROUND(K$10*K$9*K$13*M70,2),0)+IF(N70=$AA$7,ROUND(N$10*N$9*N$13*P70,2),0)+IF(Q70=$AA$7,ROUND(Q$10*Q$9*Q$13*S70,2),0),0)","v":{"$error":"#REF!"}},{"$f":"IF(#REF!=\"X\",IF(H70=$AB$7,ROUND(H$10*H$9*H$13*J70,2),0)+IF(K70=$AB$7,ROUND(K$10*K$9*K$13*M70,2),0)+IF(N70=$AB$7,ROUND(N$10*N$9*N$13*P70,2),0)+IF(Q70=$AB$7,ROUND(Q$10*Q$9*Q$13*S70,2),0),0)","v":{"$error":"#REF!"}},{"$f":"IF(#REF!=\"X\",IF(H70=$AC$7,ROUND(H$10*H$9*H$13*J70,2),0)+IF(K70=$AC$7,ROUND(K$10*K$9*K$13*M70,2),0)+IF(N70=$AC$7,ROUND(N$10*N$9*N$13*P70,2),0)+IF(Q70=$AC$7,ROUND(Q$10*Q$9*Q$13*S70,2),0),0)","v":{"$error":"#REF!"}},{"$f":"IF(#REF!=\"X\",IF(H70=$AD$7,ROUND(H$10*H$9*H$13*J70,2),0)+IF(K70=$AD$7,ROUND(K$10*K$9*K$13*M70,2),0)+IF(N70=$AD$7,ROUND(N$10*N$9*N$13*P70,2),0)+IF(Q70=$AD$7,ROUND(Q$10*Q$9*Q$13*S70,2),0),0)","v":{"$error":"#REF!"}}]
[{"$f":"IF(OR(J71<>0,M71<>0,P71<>0,S71<>0),\"\",1)","v":1},"totale incidenze",{"$nulls":3},"∑ Q i",null,null,{"$f":"SUM(I64:I70)","v":{"v":0,"d":"0.000"}},{"$f":"I71","v":{"v":0,"d":"0.000"}},null,{"$f":"SUM(L64:L70)","v":{"v":0,"d":"0.000"}},{"$f":"L71","v":{"v":0,"d":"0.000"}},null,{"$f":"SUM(O64:O70)","v":{"v":0,"d":"0.000"}},{"$f":"O71","v":{"v":0,"d":"0.000"}},null,{"$f":"SUM(R64:R70)","v":{"v":0,"d":"0.000"}},{"$f":"R71","v":{"v":0,"d":"0.000"}},{"$nulls":12},{"$f":"H73-SUM(W64:AD70)","v":{"$error":"#REF!"}}]
[{"$f":"IF(OR(H72<>0,K72<>0,N72<>0,Q72<>0),\"\",1)","v":1},"Compenso al netto di spese ed oneri CNPAIA",{"$nulls":3},"V*P*G*ΣQ",null,{"$f":"J71*H9*H10*H13","v":{"v":0,"d":"0.00 €"}},null,null,{"$f":"M71*K9*K10*K13","v":{"v":0,"d":"0.00 €"}},null,null,{"$f":"P71*N9*N10*N13","v":{"v":0,"d":"0.00 €"}},null,null,{"$f":"S71*Q9*Q10*Q13","v":{"v":0,"d":"0.00 €"}},{"$nulls":3},"eventuale aggiustamento\ndx-sx",null,{"$f":"AF71","v":{"$error":"#REF!"}}]
[null,"COMPENSO AL NETTO DELLE SPESE",{"$nulls":5},{"$f":"ROUND(SUM(H72:S72),2)","v":{"v":0,"d":"0.00 €"}},{"$nulls":12},{"$f":"IF(H73=SUM(W73:AD73),\"OK\",\"CONTROLLA\")","v":{"$error":"#REF!"}},{"$f":"SUM(W73:AD73)-H73","v":{"$error":"#REF!"}},{"$f":"SUM(W64:W72)","v":{"$error":"#REF!"}},{"$error":"#REF!"},{"$error":"#REF!"},{"$error":"#REF!"},{"$error":"#REF!"},{"$error":"#REF!"},{"$error":"#REF!"},{"$error":"#REF!"}]
[]
[null,"ESECUZIONE DEI LAVORI",{"$nulls":5},"Edilizia",null,null,"Strutture",null,null,"Impianto Elettrico",null,null,"Impianto Termo-Idrau",{"$nulls":5},"ESECUZIONE DEI LAVORI"]
[{"$f":"IF(OR(H76<>\"\",K76<>\"\",N76<>\"\",Q76<>\"\"),\"\",1)","v":1},"DIREZIONE ESECUTIVA"," C.I)ESECUZIONE DEI LAVORI  ","prestazioni affidate","incidenza Q","QcI.01\nQe.01"," Direzione lavori, assistenza al collaudo, prove d'officina (art.148, d.P.R. 207/10)8  ",{"$f":"IF(AND('Calcolo DM 140-12 + ORD. 108-20'!I89<9,'Calcolo DM 140-12 + ORD. 108-20'!I89>0),\"X\",\"\")","v":""},{"$f":"IF(H76=\"X\",J76,0)","v":{"v":0,"d":"0.000"}},{"v":0.32,"d":"0.320"},{"$f":"IF(AND('Calcolo DM 140-12 + ORD. 108-20'!L89<9,'Calcolo DM 140-12 + ORD. 108-20'!L89>0),\"X\",\"\")","v":""},{"$f":"IF(K76=\"X\",M76,0)","v":{"v":0,"d":"0.000"}},{"v":0.38,"d":"0.380"},{"$f":"IF(AND('Calcolo DM 140-12 + ORD. 108-20'!O89<9,'Calcolo DM 140-12 + ORD. 108-20'!O89>0),\"X\",\"\")","v":""},{"$f":"IF(N76=\"X\",P76,0)","v":{"v":0,"d":"0.000"}},{"v":0.32,"d":"0.320"},{"$f":"IF(AND('Calcolo DM 140-12 + ORD. 108-20'!R89<9,'Calcolo DM 140-12 + ORD. 108-20'!R89>0),\"X\",\"\")","v":""},{"$f":"IF(Q76=\"X\",S76,0)","v":{"v":0,"d":"0.000"}},{"v":0.32,"d":"0.320"},{"$nulls":3},{"$f":"IF(#REF!=\"X\",IF(H76=$W$7,ROUND(H$10*H$9*H$13*J76,2),0)+IF(K76=$W$7,ROUND(K$10*K$9*K$13*M76,2),0)+IF(N76=$W$7,ROUND(N$10*N$9*N$13*P76,2),0)+IF(Q76=$W$7,ROUND(Q$10*Q$9*Q$13*S76,2),0),0)","v":{"$error":"#REF!"}},{"$f":"IF(#REF!=\"X\",IF(H76=$X$7,ROUND(H$10*H$9*H$13*J76,2),0)+IF(K76=$X$7,ROUND(K$10*K$9*K$13*M76,2),0)+IF(N76=$X$7,ROUND(N$10*N$9*N$13*P76,2),0)+IF(Q76=$X$7,ROUND(Q$10*Q$9*Q$13*S76,2),0),0)","v":{"$error":"#REF!"}},{"$f":"IF(#REF!=\"X\",IF(H76=$Y$7,ROUND(H$10*H$9*H$13*J76,2),0)+IF(K76=$Y$7,ROUND(K$10*K$9*K$13*M76,2),0)+IF(N76=$Y$7,ROUND(N$10*N$9*N$13*P76,2),0)+IF(Q76=$Y$7,ROUND(Q$10*Q$9*Q$13*S76,2),0),0)","v":{"$error":"#REF!"}},{"$f":"IF(#REF!=\"X\",IF(H76=$Z$7,ROUND(H$10*H$9*H$13*J76,2),0)+IF(K76=$Z$7,ROUND(K$10*K$9*K$13*M76,2),0)+IF(N76=$Z$7,ROUND(N$10*N$9*N$13*P76,2),0)+IF(Q76=$Z$7,ROUND(Q$10*Q$9*Q$13*S76,2),0),0)","v":{"$error":"#REF!"}},{"$f":"IF(#REF!=\"X\",IF(H76=$AA$7,ROUND(H$10*H$9*H$13*J76,2),0)+IF(K76=$AA$7,ROUND(K$10*K$9*K$13*M76,2),0)+IF(N76=$AA$7,ROUND(N$10*N$9*N$13*P76,2),0)+IF(Q76=$AA$7,ROUND(Q$10*Q$9*Q$13*S76,2),0),0)","v":{"$error":"#REF!"}},{"$f":"IF(#REF!=\"X\",IF(H76=$AB$7,ROUND(H$10*H$9*H$13*J76,2),0)+IF(K76=$AB$7,ROUND(K$10*K$9*K$13*M76,2),0)+IF(N76=$AB$7,ROUND(N$10*N$9*N$13*P76,2),0)+IF(Q76=$AB$7,ROUND(Q$10*Q$9*Q$13*S76,2),0),0)","v":{"$error":"#REF!"}},{"$f":"IF(#REF!=\"X\",IF(H76=$AC$7,ROUND(H$10*H$9*H$13*J76,2),0)+IF(K76=$AC$7,ROUND(K$10*K$9*K$13*M76,2),0)+IF(N76=$AC$7,ROUND(N$10*N$9*N$13*P76,2),0)+IF(Q76=$AC$7,ROUND(Q$10*Q$9*Q$13*S76,2),0),0)","v":{"$error":"#REF!"}},{"$f":"IF(#REF!=\"X\",IF(H76=$AD$7,ROUND(H$10*H$9*H$13*J76,2),0)+IF(K76=$AD$7,ROUND(K$10*K$9*K$13*M76,2),0)+IF(N76=$AD$7,ROUND(N$10*N$9*N$13*P76,2),0)+IF(Q76=$AD$7,ROUND(Q$10*Q$9*Q$13*S76,2),0),0)","v":{"$error":"#REF!"}},{"$nulls":3},"X","X","X","X"]
[1,{"$nulls":4},"QcI.02\nQe.02"," Liquidazione (art.194, comma 1, d.P.R. 207/10)  ",{"$f":"IF(AND('Calcolo DM 140-12 + ORD. 108-20'!I90<9,'Calcolo DM 140-12 + ORD. 108-20'!I90>0),\"X\",\"\")","v":""},{"v":0,"d":"0.000"},{"v":0.03,"d":"0.030"},{"$f":"IF(AND('Calcolo DM 140-12 + ORD. 108-20'!L90<9,'Calcolo DM 140-12 + ORD. 108-20'!L90>0),\"X\",\"\")","v":""},{"v":0,"d":"0.000"},{"v":0.02,"d":"0.020"},{"$f":"IF(AND('Calcolo DM 140-12 + ORD. 108-20'!O90<9,'Calcolo DM 140-12 + ORD. 108-20'!O90>0),\"X\",\"\")","v":""},{"v":0,"d":"0.000"},{"v":0.03,"d":"0.030"},{"$f":"IF(AND('Calcolo DM 140-12 + ORD. 108-20'!R90<9,'Calcolo DM 140-12 + ORD. 108-20'!R90>0),\"X\",\"\")","v":""},{"v":0,"d":"0.000"},{"v":0.03,"d":"0.030"},{"$nulls":3},{"$f":"IF(#REF!=\"X\",IF(H77=$W$7,ROUND(H$10*H$9*H$13*J77,2),0)+IF(K77=$W$7,ROUND(K$10*K$9*K$13*M77,2),0)+IF(N77=$W$7,ROUND(N$10*N$9*N$13*P77,2),0)+IF(Q77=$W$7,ROUND(Q$10*Q$9*Q$13*S77,2),0),0)","v":{"$error":"#REF!"}},{"$f":"IF(#REF!=\"X\",IF(H77=$X$7,ROUND(H$10*H$9*H$13*J77,2),0)+IF(K77=$X$7,ROUND(K$10*K$9*K$13*M77,2),0)+IF(N77=$X$7,ROUND(N$10*N$9*N$13*P77,2),0)+IF(Q77=$X$7,ROUND(Q$10*Q$9*Q$13*S77,2),0),0)","v":{"$error":"#REF!"}},{"$f":"IF(#REF!=\"X\",IF(H77=$Y$7,ROUND(H$10*H$9*H$13*J77,2),0)+IF(K77=$Y$7,ROUND(K$10*K$9*K$13*M77,2),0)+IF(N77=$Y$7,ROUND(N$10*N$9*N$13*P77,2),0)+IF(Q77=$Y$7,ROUND(Q$10*Q$9*Q$13*S77,2),0),0)","v":{"$error":"#REF!"}},{"$f":"IF(#REF!=\"X\",IF(H77=$Z$7,ROUND(H$10*H$9*H$13*J77,2),0)+IF(K77=$Z$7,ROUND(K$10*K$9*K$13*M77,2),0)+IF(N77=$Z$7,ROUND(N$10*N$9*N$13*P77,2),0)+IF(Q77=$Z$7,ROUND(Q$10*Q$9*Q$13*S77,2),0),0)","v":{"$error":"#REF!"}},{"$f":"IF(#REF!=\"X\",IF(H77=$AA$7,ROUND(H$10*H$9*H$13*J77,2),0)+IF(K77=$AA$7,ROUND(K$10*K$9*K$13*M77,2),0)+IF(N77=$AA$7,ROUND(N$10*N$9*N$13*P77,2),0)+IF(Q77=$AA$7,ROUND(Q$10*Q$9*Q$13*S77,2),0),0)","v":{"$error":"#REF!"}},{"$f":"IF(#REF!=\"X\",IF(H77=$AB$7,ROUND(H$10*H$9*H$13*J77,2),0)+IF(K77=$AB$7,ROUND(K$10*K$9*K$13*M77,2),0)+IF(N77=$AB$7,ROUND(N$10*N$9*N$13*P77,2),0)+IF(Q77=$AB$7,ROUND(Q$10*Q$9*Q$13*S77,2),0),0)","v":{"$error":"#REF!"}},{"$f":"IF(#REF!=\"X\",IF(H77=$AC$7,ROUND(H$10*H$9*H$13*J77,2),0)+IF(K77=$AC$7,ROUND(K$10*K$9*K$13*M77,2),0)+IF(N77=$AC$7,ROUND(N$10*N$9*N$13*P77,2),0)+IF(Q77=$AC$7,ROUND(Q$10*Q$9*Q$13*S77,2),0),0)","v":{"$error":"#REF!"}},{"$f":"IF(#REF!=\"X\",IF(H77=$AD$7,ROUND(H$10*H$9*H$13*J77,2),0)+IF(K77=$AD$7,ROUND(K$10*K$9*K$13*M77,2),0)+IF(N77=$AD$7,ROUND(N$10*N$9*N$13*P77,2),0)+IF(Q77=$AD$7,ROUND(Q$10*Q$9*Q$13*S77,2),0),0)","v":{"$error":"#REF!"}},{"$nulls":3},"X","X","X","X"]
[1,{"$nulls":4}," QcI.03  "," Controllo aggiornamento elaborati di progetto, aggiornamento dei manuali d'uso e manutenzione (art.148, comma 4, d.P.R. 207/2010)  ",{"$f":"IF(AND('Calcolo DM 140-12 + ORD. 108-20'!I91<9,'Calcolo DM 140-12 + ORD. 108-20'!I91>0),\"X\",\"\")","v":""},{"v":0,"d":"0.000"},{"v":0.02,"d":"0.020"},{"$f":"IF(AND('Calcolo DM 140-12 + ORD. 108-20'!L91<9,'Calcolo DM 140-12 + ORD. 108-20'!L91>0),\"X\",\"\")","v":""},{"v":0,"d":"0.000"},{"v":0.02,"d":"0.020"},{"$f":"IF(AND('Calcolo DM 140-12 + ORD. 108-20'!O91<9,'Calcolo DM 140-12 + ORD. 108-20'!O91>0),\"X\",\"\")","v":""},{"v":0,"d":"0.000"},{"v":0.02,"d":"0.020"},{"$f":"IF(AND('Calcolo DM 140-12 + ORD. 108-20'!R91<9,'Calcolo DM 140-12 + ORD. 108-20'!R91>0),\"X\",\"\")","v":""},{"v":0,"d":"0.000"},{"v":0.02,"d":"0.020"},{"$nulls":3},{"$f":"IF(#REF!=\"X\",IF(H78=$W$7,ROUND(H$10*H$9*H$13*J78,2),0)+IF(K78=$W$7,ROUND(K$10*K$9*K$13*M78,2),0)+IF(N78=$W$7,ROUND(N$10*N$9*N$13*P78,2),0)+IF(Q78=$W$7,ROUND(Q$10*Q$9*Q$13*S78,2),0),0)","v":{"$error":"#REF!"}},{"$f":"IF(#REF!=\"X\",IF(H78=$X$7,ROUND(H$10*H$9*H$13*J78,2),0)+IF(K78=$X$7,ROUND(K$10*K$9*K$13*M78,2),0)+IF(N78=$X$7,ROUND(N$10*N$9*N$13*P78,2),0)+IF(Q78=$X$7,ROUND(Q$10*Q$9*Q$13*S78,2),0),0)","v":{"$error":"#REF!"}},{"$f":"IF(#REF!=\"X\",IF(H78=$Y$7,ROUND(H$10*H$9*H$13*J78,2),0)+IF(K78=$Y$7,ROUND(K$10*K$9*K$13*M78,2),0)+IF(N78=$Y$7,ROUND(N$10*N$9*N$13*P78,2),0)+IF(Q78=$Y$7,ROUND(Q$10*Q$9*Q$13*S78,2),0),0)","v":{"$error":"#REF!"}},{"$f":"IF(#REF!=\"X\",IF(H78=$Z$7,ROUND(H$10*H$9*H$13*J78,2),0)+IF(K78=$Z$7,ROUND(K$10*K$9*K$13*M78,2),0)+IF(N78=$Z$7,ROUND(N$10*N$9*N$13*P78,2),0)+IF(Q78=$Z$7,ROUND(Q$10*Q$9*Q$13*S78,2),0),0)","v":{"$error":"#REF!"}},{"$f":"IF(#REF!=\"X\",IF(H78=$AA$7,ROUND(H$10*H$9*H$13*J78,2),0)+IF(K78=$AA$7,ROUND(K$10*K$9*K$13*M78,2),0)+IF(N78=$AA$7,ROUND(N$10*N$9*N$13*P78,2),0)+IF(Q78=$AA$7,ROUND(Q$10*Q$9*Q$13*S78,2),0),0)","v":{"$error":"#REF!"}},{"$f":"IF(#REF!=\"X\",IF(H78=$AB$7,ROUND(H$10*H$9*H$13*J78,2),0)+IF(K78=$AB$7,ROUND(K$10*K$9*K$13*M78,2),0)+IF(N78=$AB$7,ROUND(N$10*N$9*N$13*P78,2),0)+IF(Q78=$AB$7,ROUND(Q$10*Q$9*Q$13*S78,2),0),0)","v":{"$error":"#REF!"}},{"$f":"IF(#REF!=\"X\",IF(H78=$AC$7,ROUND(H$10*H$9*H$13*J78,2),0)+IF(K78=$AC$7,ROUND(K$10*K$9*K$13*M78,2),0)+IF(N78=$AC$7,ROUND(N$10*N$9*N$13*P78,2),0)+IF(Q78=$AC$7,ROUND(Q$10*Q$9*Q$13*S78,2),0),0)","v":{"$error":"#REF!"}},{"$f":"IF(#REF!=\"X\",IF(H78=$AD$7,ROUND(H$10*H$9*H$13*J78,2),0)+IF(K78=$AD$7,ROUND(K$10*K$9*K$13*M78,2),0)+IF(N78=$AD$7,ROUND(N$10*N$9*N$13*P78,2),0)+IF(Q78=$AD$7,ROUND(Q$10*Q$9*Q$13*S78,2),0),0)","v":{"$error":"#REF!"}}]
[1,{"$nulls":4}," QcI.04  "," Coordinamento e supervisione dell'ufficio di direzione lavori (art.148, comma 2, d.lgs. 163/06)  ",{"$f":"IF(AND('Calcolo DM 140-12 + ORD. 108-20'!I92<9,'Calcolo DM 140-12 + ORD. 108-20'!I92>0),\"X\",\"\")","v":""},{"v":0,"d":"0.000"},{"v":0.02,"d":"0.020"},{"$f":"IF(AND('Calcolo DM 140-12 + ORD. 108-20'!L92<9,'Calcolo DM 140-12 + ORD. 108-20'!L92>0),\"X\",\"\")","v":""},{"v":0,"d":"0.000"},{"v":0.02,"d":"0.020"},{"$f":"IF(AND('Calcolo DM 140-12 + ORD. 108-20'!O92<9,'Calcolo DM 140-12 + ORD. 108-20'!O92>0),\"X\",\"\")","v":""},{"v":0,"d":"0.000"},{"v":0.02,"d":"0.020"},{"$f":"IF(AND('Calcolo DM 140-12 + ORD. 108-20'!R92<9,'Calcolo DM 140-12 + ORD. 108-20'!R92>0),\"X\",\"\")","v":""},{"v":0,"d":"0.000"},{"v":0.02,"d":"0.020"},{"$nulls":3},{"$f":"IF(#REF!=\"X\",IF(H79=$W$7,ROUND(H$10*H$9*H$13*J79,2),0)+IF(K79=$W$7,ROUND(K$10*K$9*K$13*M79,2),0)+IF(N79=$W$7,ROUND(N$10*N$9*N$13*P79,2),0)+IF(Q79=$W$7,ROUND(Q$10*Q$9*Q$13*S79,2),0),0)","v":{"$error":"#REF!"}},{"$f":"IF(#REF!=\"X\",IF(H79=$X$7,ROUND(H$10*H$9*H$13*J79,2),0)+IF(K79=$X$7,ROUND(K$10*K$9*K$13*M79,2),0)+IF(N79=$X$7,ROUND(N$10*N$9*N$13*P79,2),0)+IF(Q79=$X$7,ROUND(Q$10*Q$9*Q$13*S79,2),0),0)","v":{"$error":"#REF!"}},{"$f":"IF(#REF!=\"X\",IF(H79=$Y$7,ROUND(H$10*H$9*H$13*J79,2),0)+IF(K79=$Y$7,ROUND(K$10*K$9*K$13*M79,2),0)+IF(N79=$Y$7,ROUND(N$10*N$9*N$13*P79,2),0)+IF(Q79=$Y$7,ROUND(Q$10*Q$9*Q$13*S79,2),0),0)","v":{"$error":"#REF!"}},{"$f":"IF(#REF!=\"X\",IF(H79=$Z$7,ROUND(H$10*H$9*H$13*J79,2),0)+IF(K79=$Z$7,ROUND(K$10*K$9*K$13*M79,2),0)+IF(N79=$Z$7,ROUND(N$10*N$9*N$13*P79,2),0)+IF(Q79=$Z$7,ROUND(Q$10*Q$9*Q$13*S79,2),0),0)","v":{"$error":"#REF!"}},{"$f":"IF(#REF!=\"X\",IF(H79=$AA$7,ROUND(H$10*H$9*H$13*J79,2),0)+IF(K79=$AA$7,ROUND(K$10*K$9*K$13*M79,2),0)+IF(N79=$AA$7,ROUND(N$10*N$9*N$13*P79,2),0)+IF(Q79=$AA$7,ROUND(Q$10*Q$9*Q$13*S79,2),0),0)","v":{"$error":"#REF!"}},{"$f":"IF(#REF!=\"X\",IF(H79=$AB$7,ROUND(H$10*H$9*H$13*J79,2),0)+IF(K79=$AB$7,ROUND(K$10*K$9*K$13*M79,2),0)+IF(N79=$AB$7,ROUND(N$10*N$9*N$13*P79,2),0)+IF(Q79=$AB$7,ROUND(Q$10*Q$9*Q$13*S79,2),0),0)","v":{"$error":"#REF!"}},{"$f":"IF(#REF!=\"X\",IF(H79=$AC$7,ROUND(H$10*H$9*H$13*J79,2),0)+IF(K79=$AC$7,ROUND(K$10*K$9*K$13*M79,2),0)+IF(N79=$AC$7,ROUND(N$10*N$9*N$13*P79,2),0)+IF(Q79=$AC$7,ROUND(Q$10*Q$9*Q$13*S79,2),0),0)","v":{"$error":"#REF!"}},{"$f":"IF(#REF!=\"X\",IF(H79=$AD$7,ROUND(H$10*H$9*H$13*J79,2),0)+IF(K79=$AD$7,ROUND(K$10*K$9*K$13*M79,2),0)+IF(N79=$AD$7,ROUND(N$10*N$9*N$13*P79,2),0)+IF(Q79=$AD$7,ROUND(Q$10*Q$9*Q$13*S79,2),0),0)","v":{"$error":"#REF!"}}]
[1,{"$nulls":4}," QcI.05  "," Ufficio della direzione lavori, per ogni addetto con qualifica di direttore operativo (art.149, d.lgs. 163/06)  ",{"$f":"IF(AND('Calcolo DM 140-12 + ORD. 108-20'!I93<9,'Calcolo DM 140-12 + ORD. 108-20'!I93>0),\"X\",\"\")","v":""},{"v":0,"d":"0.000"},{"v":0.1,"d":"0.100"},{"$f":"IF(AND('Calcolo DM 140-12 + ORD. 108-20'!L93<9,'Calcolo DM 140-12 + ORD. 108-20'!L93>0),\"X\",\"\")","v":""},{"v":0,"d":"0.000"},{"v":0.1,"d":"0.100"},{"$f":"IF(AND('Calcolo DM 140-12 + ORD. 108-20'!O93<9,'Calcolo DM 140-12 + ORD. 108-20'!O93>0),\"X\",\"\")","v":""},{"v":0,"d":"0.000"},{"v":0.1,"d":"0.100"},{"$f":"IF(AND('Calcolo DM 140-12 + ORD. 108-20'!R93<9,'Calcolo DM 140-12 + ORD. 108-20'!R93>0),\"X\",\"\")","v":""},{"v":0,"d":"0.000"},{"v":0.1,"d":"0.100"},{"$nulls":3},{"$f":"IF(#REF!=\"X\",IF(H80=$W$7,ROUND(H$10*H$9*H$13*J80,2),0)+IF(K80=$W$7,ROUND(K$10*K$9*K$13*M80,2),0)+IF(N80=$W$7,ROUND(N$10*N$9*N$13*P80,2),0)+IF(Q80=$W$7,ROUND(Q$10*Q$9*Q$13*S80,2),0),0)","v":{"$error":"#REF!"}},{"$f":"IF(#REF!=\"X\",IF(H80=$X$7,ROUND(H$10*H$9*H$13*J80,2),0)+IF(K80=$X$7,ROUND(K$10*K$9*K$13*M80,2),0)+IF(N80=$X$7,ROUND(N$10*N$9*N$13*P80,2),0)+IF(Q80=$X$7,ROUND(Q$10*Q$9*Q$13*S80,2),0),0)","v":{"$error":"#REF!"}},{"$f":"IF(#REF!=\"X\",IF(H80=$Y$7,ROUND(H$10*H$9*H$13*J80,2),0)+IF(K80=$Y$7,ROUND(K$10*K$9*K$13*M80,2),0)+IF(N80=$Y$7,ROUND(N$10*N$9*N$13*P80,2),0)+IF(Q80=$Y$7,ROUND(Q$10*Q$9*Q$13*S80,2),0),0)","v":{"$error":"#REF!"}},{"$f":"IF(#REF!=\"X\",IF(H80=$Z$7,ROUND(H$10*H$9*H$13*J80,2),0)+IF(K80=$Z$7,ROUND(K$10*K$9*K$13*M80,2),0)+IF(N80=$Z$7,ROUND(N$10*N$9*N$13*P80,2),0)+IF(Q80=$Z$7,ROUND(Q$10*Q$9*Q$13*S80,2),0),0)","v":{"$error":"#REF!"}},{"$f":"IF(#REF!=\"X\",IF(H80=$AA$7,ROUND(H$10*H$9*H$13*J80,2),0)+IF(K80=$AA$7,ROUND(K$10*K$9*K$13*M80,2),0)+IF(N80=$AA$7,ROUND(N$10*N$9*N$13*P80,2),0)+IF(Q80=$AA$7,ROUND(Q$10*Q$9*Q$13*S80,2),0),0)","v":{"$error":"#REF!"}},{"$f":"IF(#REF!=\"X\",IF(H80=$AB$7,ROUND(H$10*H$9*H$13*J80,2),0)+IF(K80=$AB$7,ROUND(K$10*K$9*K$13*M80,2),0)+IF(N80=$AB$7,ROUND(N$10*N$9*N$13*P80,2),0)+IF(Q80=$AB$7,ROUND(Q$10*Q$9*Q$13*S80,2),0),0)","v":{"$error":"#REF!"}},{"$f":"IF(#REF!=\"X\",IF(H80=$AC$7,ROUND(H$10*H$9*H$13*J80,2),0)+IF(K80=$AC$7,ROUND(K$10*K$9*K$13*M80,2),0)+IF(N80=$AC$7,ROUND(N$10*N$9*N$13*P80,2),0)+IF(Q80=$AC$7,ROUND(Q$10*Q$9*Q$13*S80,2),0),0)","v":{"$error":"#REF!"}},{"$f":"IF(#REF!=\"X\",IF(H80=$AD$7,ROUND(H$10*H$9*H$13*J80,2),0)+IF(K80=$AD$7,ROUND(K$10*K$9*K$13*M80,2),0)+IF(N80=$AD$7,ROUND(N$10*N$9*N$13*P80,2),0)+IF(Q80=$AD$7,ROUND(Q$10*Q$9*Q$13*S80,2),0),0)","v":{"$error":"#REF!"}}]
[1,{"$nulls":4}," QcI.06  "," Ufficio della direzione lavori, per ogni addetto con qualifica di ispettore di cantiere (art.150, d.lgs. 163/06)  ",{"$f":"IF(AND('Calcolo DM 140-12 + ORD. 108-20'!I94<9,'Calcolo DM 140-12 + ORD. 108-20'!I94>0),\"X\",\"\")","v":""},{"v":0,"d":"0.000"},{"v":0.06,"d":"0.060"},{"$f":"IF(AND('Calcolo DM 140-12 + ORD. 108-20'!L94<9,'Calcolo DM 140-12 + ORD. 108-20'!L94>0),\"X\",\"\")","v":""},{"v":0,"d":"0.000"},{"v":0.06,"d":"0.060"},{"$f":"IF(AND('Calcolo DM 140-12 + ORD. 108-20'!O94<9,'Calcolo DM 140-12 + ORD. 108-20'!O94>0),\"X\",\"\")","v":""},{"v":0,"d":"0.000"},{"v":0.06,"d":"0.060"},{"$f":"IF(AND('Calcolo DM 140-12 + ORD. 108-20'!R94<9,'Calcolo DM 140-12 + ORD. 108-20'!R94>0),\"X\",\"\")","v":""},{"v":0,"d":"0.000"},{"v":0.06,"d":"0.060"},{"$nulls":3},{"$f":"IF(#REF!=\"X\",IF(H81=$W$7,ROUND(H$10*H$9*H$13*J81,2),0)+IF(K81=$W$7,ROUND(K$10*K$9*K$13*M81,2),0)+IF(N81=$W$7,ROUND(N$10*N$9*N$13*P81,2),0)+IF(Q81=$W$7,ROUND(Q$10*Q$9*Q$13*S81,2),0),0)","v":{"$error":"#REF!"}},{"$f":"IF(#REF!=\"X\",IF(H81=$X$7,ROUND(H$10*H$9*H$13*J81,2),0)+IF(K81=$X$7,ROUND(K$10*K$9*K$13*M81,2),0)+IF(N81=$X$7,ROUND(N$10*N$9*N$13*P81,2),0)+IF(Q81=$X$7,ROUND(Q$10*Q$9*Q$13*S81,2),0),0)","v":{"$error":"#REF!"}},{"$f":"IF(#REF!=\"X\",IF(H81=$Y$7,ROUND(H$10*H$9*H$13*J81,2),0)+IF(K81=$Y$7,ROUND(K$10*K$9*K$13*M81,2),0)+IF(N81=$Y$7,ROUND(N$10*N$9*N$13*P81,2),0)+IF(Q81=$Y$7,ROUND(Q$10*Q$9*Q$13*S81,2),0),0)","v":{"$error":"#REF!"}},{"$f":"IF(#REF!=\"X\",IF(H81=$Z$7,ROUND(H$10*H$9*H$13*J81,2),0)+IF(K81=$Z$7,ROUND(K$10*K$9*K$13*M81,2),0)+IF(N81=$Z$7,ROUND(N$10*N$9*N$13*P81,2),0)+IF(Q81=$Z$7,ROUND(Q$10*Q$9*Q$13*S81,2),0),0)","v":{"$error":"#REF!"}},{"$f":"IF(#REF!=\"X\",IF(H81=$AA$7,ROUND(H$10*H$9*H$13*J81,2),0)+IF(K81=$AA$7,ROUND(K$10*K$9*K$13*M81,2),0)+IF(N81=$AA$7,ROUND(N$10*N$9*N$13*P81,2),0)+IF(Q81=$AA$7,ROUND(Q$10*Q$9*Q$13*S81,2),0),0)","v":{"$error":"#REF!"}},{"$f":"IF(#REF!=\"X\",IF(H81=$AB$7,ROUND(H$10*H$9*H$13*J81,2),0)+IF(K81=$AB$7,ROUND(K$10*K$9*K$13*M81,2),0)+IF(N81=$AB$7,ROUND(N$10*N$9*N$13*P81,2),0)+IF(Q81=$AB$7,ROUND(Q$10*Q$9*Q$13*S81,2),0),0)","v":{"$error":"#REF!"}},{"$f":"IF(#REF!=\"X\",IF(H81=$AC$7,ROUND(H$10*H$9*H$13*J81,2),0)+IF(K81=$AC$7,ROUND(K$10*K$9*K$13*M81,2),0)+IF(N81=$AC$7,ROUND(N$10*N$9*N$13*P81,2),0)+IF(Q81=$AC$7,ROUND(Q$10*Q$9*Q$13*S81,2),0),0)","v":{"$error":"#REF!"}},{"$f":"IF(#REF!=\"X\",IF(H81=$AD$7,ROUND(H$10*H$9*H$13*J81,2),0)+IF(K81=$AD$7,ROUND(K$10*K$9*K$13*M81,2),0)+IF(N81=$AD$7,ROUND(N$10*N$9*N$13*P81,2),0)+IF(Q81=$AD$7,ROUND(Q$10*Q$9*Q$13*S81,2),0),0)","v":{"$error":"#REF!"}}]
[1,{"$nulls":4}," QcI.07  "," Variante delle quantita del progetto in corso d'opera (art.161, d.P.R. 207/2010)",{"$f":"IF(AND('Calcolo DM 140-12 + ORD. 108-20'!I95<9,'Calcolo DM 140-12 + ORD. 108-20'!I95>0),\"X\",\"\")","v":""},{"v":0,"d":"0.000"},{"v":0.14,"d":"0.140"},{"$f":"IF(AND('Calcolo DM 140-12 + ORD. 108-20'!L95<9,'Calcolo DM 140-12 + ORD. 108-20'!L95>0),\"X\",\"\")","v":""},{"v":0,"d":"0.000"},{"v":0.09,"d":"0.090"},{"$f":"IF(AND('Calcolo DM 140-12 + ORD. 108-20'!O95<9,'Calcolo DM 140-12 + ORD. 108-20'!O95>0),\"X\",\"\")","v":""},{"v":0,"d":"0.000"},{"v":0.15,"d":"0.150"},{"$f":"IF(AND('Calcolo DM 140-12 + ORD. 108-20'!R95<9,'Calcolo DM 140-12 + ORD. 108-20'!R95>0),\"X\",\"\")","v":""},{"v":0,"d":"0.000"},{"v":0.15,"d":"0.150"},{"$nulls":3},{"$f":"IF(#REF!=\"X\",IF(H82=$W$7,ROUND(H$10*H$9*H$13*J82,2),0)+IF(K82=$W$7,ROUND(K$10*K$9*K$13*M82,2),0)+IF(N82=$W$7,ROUND(N$10*N$9*N$13*P82,2),0)+IF(Q82=$W$7,ROUND(Q$10*Q$9*Q$13*S82,2),0),0)","v":{"$error":"#REF!"}},{"$f":"IF(#REF!=\"X\",IF(H82=$X$7,ROUND(H$10*H$9*H$13*J82,2),0)+IF(K82=$X$7,ROUND(K$10*K$9*K$13*M82,2),0)+IF(N82=$X$7,ROUND(N$10*N$9*N$13*P82,2),0)+IF(Q82=$X$7,ROUND(Q$10*Q$9*Q$13*S82,2),0),0)","v":{"$error":"#REF!"}},{"$f":"IF(#REF!=\"X\",IF(H82=$Y$7,ROUND(H$10*H$9*H$13*J82,2),0)+IF(K82=$Y$7,ROUND(K$10*K$9*K$13*M82,2),0)+IF(N82=$Y$7,ROUND(N$10*N$9*N$13*P82,2),0)+IF(Q82=$Y$7,ROUND(Q$10*Q$9*Q$13*S82,2),0),0)","v":{"$error":"#REF!"}},{"$f":"IF(#REF!=\"X\",IF(H82=$Z$7,ROUND(H$10*H$9*H$13*J82,2),0)+IF(K82=$Z$7,ROUND(K$10*K$9*K$13*M82,2),0)+IF(N82=$Z$7,ROUND(N$10*N$9*N$13*P82,2),0)+IF(Q82=$Z$7,ROUND(Q$10*Q$9*Q$13*S82,2),0),0)","v":{"$error":"#REF!"}},{"$f":"IF(#REF!=\"X\",IF(H82=$AA$7,ROUND(H$10*H$9*H$13*J82,2),0)+IF(K82=$AA$7,ROUND(K$10*K$9*K$13*M82,2),0)+IF(N82=$AA$7,ROUND(N$10*N$9*N$13*P82,2),0)+IF(Q82=$AA$7,ROUND(Q$10*Q$9*Q$13*S82,2),0),0)","v":{"$error":"#REF!"}},{"$f":"IF(#REF!=\"X\",IF(H82=$AB$7,ROUND(H$10*H$9*H$13*J82,2),0)+IF(K82=$AB$7,ROUND(K$10*K$9*K$13*M82,2),0)+IF(N82=$AB$7,ROUND(N$10*N$9*N$13*P82,2),0)+IF(Q82=$AB$7,ROUND(Q$10*Q$9*Q$13*S82,2),0),0)","v":{"$error":"#REF!"}},{"$f":"IF(#REF!=\"X\",IF(H82=$AC$7,ROUND(H$10*H$9*H$13*J82,2),0)+IF(K82=$AC$7,ROUND(K$10*K$9*K$13*M82,2),0)+IF(N82=$AC$7,ROUND(N$10*N$9*N$13*P82,2),0)+IF(Q82=$AC$7,ROUND(Q$10*Q$9*Q$13*S82,2),0),0)","v":{"$error":"#REF!"}},{"$f":"IF(#REF!=\"X\",IF(H82=$AD$7,ROUND(H$10*H$9*H$13*J82,2),0)+IF(K82=$AD$7,ROUND(K$10*K$9*K$13*M82,2),0)+IF(N82=$AD$7,ROUND(N$10*N$9*N$13*P82,2),0)+IF(Q82=$AD$7,ROUND(Q$10*Q$9*Q$13*S82,2),0),0)","v":{"$error":"#REF!"}}]
[1,{"$nulls":4},"QcI.08\nQe.04"," Variante del progetto in corso d'opera (art.161, d.P.R. 207/2010) 10  ",{"$f":"IF(AND('Calcolo DM 140-12 + ORD. 108-20'!I96<9,'Calcolo DM 140-12 + ORD. 108-20'!I96>0),\"X\",\"\")","v":""},{"v":0,"d":"0.000"},{"v":0.41,"d":"0.410"},{"$f":"IF(AND('Calcolo DM 140-12 + ORD. 108-20'!L96<9,'Calcolo DM 140-12 + ORD. 108-20'!L96>0),\"X\",\"\")","v":""},{"v":0,"d":"0.000"},{"v":0.43,"d":"0.430"},{"$f":"IF(AND('Calcolo DM 140-12 + ORD. 108-20'!O96<9,'Calcolo DM 140-12 + ORD. 108-20'!O96>0),\"X\",\"\")","v":""},{"v":0,"d":"0.000"},{"v":0.32,"d":"0.320"},{"$f":"IF(AND('Calcolo DM 140-12 + ORD. 108-20'!R96<9,'Calcolo DM 140-12 + ORD. 108-20'!R96>0),\"X\",\"\")","v":""},{"v":0,"d":"0.000"},{"v":0.32,"d":"0.320"},{"$nulls":3},{"$f":"IF(#REF!=\"X\",IF(H83=$W$7,ROUND(H$10*H$9*H$13*J83,2),0)+IF(K83=$W$7,ROUND(K$10*K$9*K$13*M83,2),0)+IF(N83=$W$7,ROUND(N$10*N$9*N$13*P83,2),0)+IF(Q83=$W$7,ROUND(Q$10*Q$9*Q$13*S83,2),0),0)","v":{"$error":"#REF!"}},{"$f":"IF(#REF!=\"X\",IF(H83=$X$7,ROUND(H$10*H$9*H$13*J83,2),0)+IF(K83=$X$7,ROUND(K$10*K$9*K$13*M83,2),0)+IF(N83=$X$7,ROUND(N$10*N$9*N$13*P83,2),0)+IF(Q83=$X$7,ROUND(Q$10*Q$9*Q$13*S83,2),0),0)","v":{"$error":"#REF!"}},{"$f":"IF(#REF!=\"X\",IF(H83=$Y$7,ROUND(H$10*H$9*H$13*J83,2),0)+IF(K83=$Y$7,ROUND(K$10*K$9*K$13*M83,2),0)+IF(N83=$Y$7,ROUND(N$10*N$9*N$13*P83,2),0)+IF(Q83=$Y$7,ROUND(Q$10*Q$9*Q$13*S83,2),0),0)","v":{"$error":"#REF!"}},{"$f":"IF(#REF!=\"X\",IF(H83=$Z$7,ROUND(H$10*H$9*H$13*J83,2),0)+IF(K83=$Z$7,ROUND(K$10*K$9*K$13*M83,2),0)+IF(N83=$Z$7,ROUND(N$10*N$9*N$13*P83,2),0)+IF(Q83=$Z$7,ROUND(Q$10*Q$9*Q$13*S83,2),0),0)","v":{"$error":"#REF!"}},{"$f":"IF(#REF!=\"X\",IF(H83=$AA$7,ROUND(H$10*H$9*H$13*J83,2),0)+IF(K83=$AA$7,ROUND(K$10*K$9*K$13*M83,2),0)+IF(N83=$AA$7,ROUND(N$10*N$9*N$13*P83,2),0)+IF(Q83=$AA$7,ROUND(Q$10*Q$9*Q$13*S83,2),0),0)","v":{"$error":"#REF!"}},{"$f":"IF(#REF!=\"X\",IF(H83=$AB$7,ROUND(H$10*H$9*H$13*J83,2),0)+IF(K83=$AB$7,ROUND(K$10*K$9*K$13*M83,2),0)+IF(N83=$AB$7,ROUND(N$10*N$9*N$13*P83,2),0)+IF(Q83=$AB$7,ROUND(Q$10*Q$9*Q$13*S83,2),0),0)","v":{"$error":"#REF!"}},{"$f":"IF(#REF!=\"X\",IF(H83=$AC$7,ROUND(H$10*H$9*H$13*J83,2),0)+IF(K83=$AC$7,ROUND(K$10*K$9*K$13*M83,2),0)+IF(N83=$AC$7,ROUND(N$10*N$9*N$13*P83,2),0)+IF(Q83=$AC$7,ROUND(Q$10*Q$9*Q$13*S83,2),0),0)","v":{"$error":"#REF!"}},{"$f":"IF(#REF!=\"X\",IF(H83=$AD$7,ROUND(H$10*H$9*H$13*J83,2),0)+IF(K83=$AD$7,ROUND(K$10*K$9*K$13*M83,2),0)+IF(N83=$AD$7,ROUND(N$10*N$9*N$13*P83,2),0)+IF(Q83=$AD$7,ROUND(Q$10*Q$9*Q$13*S83,2),0),0)","v":{"$error":"#REF!"}}]
[1,{"$nulls":4},"QcI.09\nQe.05"," Contabilita dei lavori a misura (art.185, d.P.R. 207/10)  ",{"$f":"IF(AND('Calcolo DM 140-12 + ORD. 108-20'!I97<9,'Calcolo DM 140-12 + ORD. 108-20'!I97>0),\"X\",\"\")","v":""},{"v":0,"d":"0.000"},{"v":0.18,"d":"0.180"},{"$f":"IF(AND('Calcolo DM 140-12 + ORD. 108-20'!L97<9,'Calcolo DM 140-12 + ORD. 108-20'!L97>0),\"X\",\"\")","v":""},{"v":0,"d":"0.000"},{"v":0.18,"d":"0.180"},{"$f":"IF(AND('Calcolo DM 140-12 + ORD. 108-20'!O97<9,'Calcolo DM 140-12 + ORD. 108-20'!O97>0),\"X\",\"\")","v":""},{"v":0,"d":"0.000"},{"v":0.13,"d":"0.130"},{"$f":"IF(AND('Calcolo DM 140-12 + ORD. 108-20'!R97<9,'Calcolo DM 140-12 + ORD. 108-20'!R97>0),\"X\",\"\")","v":""},{"v":0,"d":"0.000"},{"v":0.13,"d":"0.130"},{"$nulls":3},{"$f":"IF(#REF!=\"X\",IF(H84=$W$7,ROUND(H$10*H$9*H$13*J84,2),0)+IF(K84=$W$7,ROUND(K$10*K$9*K$13*M84,2),0)+IF(N84=$W$7,ROUND(N$10*N$9*N$13*P84,2),0)+IF(Q84=$W$7,ROUND(Q$10*Q$9*Q$13*S84,2),0),0)","v":{"$error":"#REF!"}},{"$f":"IF(#REF!=\"X\",IF(H84=$X$7,ROUND(H$10*H$9*H$13*J84,2),0)+IF(K84=$X$7,ROUND(K$10*K$9*K$13*M84,2),0)+IF(N84=$X$7,ROUND(N$10*N$9*N$13*P84,2),0)+IF(Q84=$X$7,ROUND(Q$10*Q$9*Q$13*S84,2),0),0)","v":{"$error":"#REF!"}},{"$f":"IF(#REF!=\"X\",IF(H84=$Y$7,ROUND(H$10*H$9*H$13*J84,2),0)+IF(K84=$Y$7,ROUND(K$10*K$9*K$13*M84,2),0)+IF(N84=$Y$7,ROUND(N$10*N$9*N$13*P84,2),0)+IF(Q84=$Y$7,ROUND(Q$10*Q$9*Q$13*S84,2),0),0)","v":{"$error":"#REF!"}},{"$f":"IF(#REF!=\"X\",IF(H84=$Z$7,ROUND(H$10*H$9*H$13*J84,2),0)+IF(K84=$Z$7,ROUND(K$10*K$9*K$13*M84,2),0)+IF(N84=$Z$7,ROUND(N$10*N$9*N$13*P84,2),0)+IF(Q84=$Z$7,ROUND(Q$10*Q$9*Q$13*S84,2),0),0)","v":{"$error":"#REF!"}},{"$f":"IF(#REF!=\"X\",IF(H84=$AA$7,ROUND(H$10*H$9*H$13*J84,2),0)+IF(K84=$AA$7,ROUND(K$10*K$9*K$13*M84,2),0)+IF(N84=$AA$7,ROUND(N$10*N$9*N$13*P84,2),0)+IF(Q84=$AA$7,ROUND(Q$10*Q$9*Q$13*S84,2),0),0)","v":{"$error":"#REF!"}},{"$f":"IF(#REF!=\"X\",IF(H84=$AB$7,ROUND(H$10*H$9*H$13*J84,2),0)+IF(K84=$AB$7,ROUND(K$10*K$9*K$13*M84,2),0)+IF(N84=$AB$7,ROUND(N$10*N$9*N$13*P84,2),0)+IF(Q84=$AB$7,ROUND(Q$10*Q$9*Q$13*S84,2),0),0)","v":{"$error":"#REF!"}},{"$f":"IF(#REF!=\"X\",IF(H84=$AC$7,ROUND(H$10*H$9*H$13*J84,2),0)+IF(K84=$AC$7,ROUND(K$10*K$9*K$13*M84,2),0)+IF(N84=$AC$7,ROUND(N$10*N$9*N$13*P84,2),0)+IF(Q84=$AC$7,ROUND(Q$10*Q$9*Q$13*S84,2),0),0)","v":{"$error":"#REF!"}},{"$f":"IF(#REF!=\"X\",IF(H84=$AD$7,ROUND(H$10*H$9*H$13*J84,2),0)+IF(K84=$AD$7,ROUND(K$10*K$9*K$13*M84,2),0)+IF(N84=$AD$7,ROUND(N$10*N$9*N$13*P84,2),0)+IF(Q84=$AD$7,ROUND(Q$10*Q$9*Q$13*S84,2),0),0)","v":{"$error":"#REF!"}},{"$nulls":3},"X","X","X","X"]
[1,{"$nulls":4}," QcI.10  "," Contabilita dei lavori a corpo (art.185, d.P.R. 207/10  ",{"$f":"IF(AND('Calcolo DM 140-12 + ORD. 108-20'!I98<9,'Calcolo DM 140-12 + ORD. 108-20'!I98>0),\"X\",\"\")","v":""},{"v":0,"d":"0.000"},{"v":0.1,"d":"0.100"},{"$f":"IF(AND('Calcolo DM 140-12 + ORD. 108-20'!L98<9,'Calcolo DM 140-12 + ORD. 108-20'!L98>0),\"X\",\"\")","v":""},{"v":0,"d":"0.000"},{"v":0.1,"d":"0.100"},{"$f":"IF(AND('Calcolo DM 140-12 + ORD. 108-20'!O98<9,'Calcolo DM 140-12 + ORD. 108-20'!O98>0),\"X\",\"\")","v":""},{"v":0,"d":"0.000"},{"v":0.08,"d":"0.080"},{"$f":"IF(AND('Calcolo DM 140-12 + ORD. 108-20'!R98<9,'Calcolo DM 140-12 + ORD. 108-20'!R98>0),\"X\",\"\")","v":""},{"v":0,"d":"0.000"},{"v":0.08,"d":"0.080"},{"$nulls":3},{"$f":"IF(#REF!=\"X\",IF(H85=$W$7,ROUND(H$10*H$9*H$13*J85,2),0)+IF(K85=$W$7,ROUND(K$10*K$9*K$13*M85,2),0)+IF(N85=$W$7,ROUND(N$10*N$9*N$13*P85,2),0)+IF(Q85=$W$7,ROUND(Q$10*Q$9*Q$13*S85,2),0),0)","v":{"$error":"#REF!"}},{"$f":"IF(#REF!=\"X\",IF(H85=$X$7,ROUND(H$10*H$9*H$13*J85,2),0)+IF(K85=$X$7,ROUND(K$10*K$9*K$13*M85,2),0)+IF(N85=$X$7,ROUND(N$10*N$9*N$13*P85,2),0)+IF(Q85=$X$7,ROUND(Q$10*Q$9*Q$13*S85,2),0),0)","v":{"$error":"#REF!"}},{"$f":"IF(#REF!=\"X\",IF(H85=$Y$7,ROUND(H$10*H$9*H$13*J85,2),0)+IF(K85=$Y$7,ROUND(K$10*K$9*K$13*M85,2),0)+IF(N85=$Y$7,ROUND(N$10*N$9*N$13*P85,2),0)+IF(Q85=$Y$7,ROUND(Q$10*Q$9*Q$13*S85,2),0),0)","v":{"$error":"#REF!"}},{"$f":"IF(#REF!=\"X\",IF(H85=$Z$7,ROUND(H$10*H$9*H$13*J85,2),0)+IF(K85=$Z$7,ROUND(K$10*K$9*K$13*M85,2),0)+IF(N85=$Z$7,ROUND(N$10*N$9*N$13*P85,2),0)+IF(Q85=$Z$7,ROUND(Q$10*Q$9*Q$13*S85,2),0),0)","v":{"$error":"#REF!"}},{"$f":"IF(#REF!=\"X\",IF(H85=$AA$7,ROUND(H$10*H$9*H$13*J85,2),0)+IF(K85=$AA$7,ROUND(K$10*K$9*K$13*M85,2),0)+IF(N85=$AA$7,ROUND(N$10*N$9*N$13*P85,2),0)+IF(Q85=$AA$7,ROUND(Q$10*Q$9*Q$13*S85,2),0),0)","v":{"$error":"#REF!"}},{"$f":"IF(#REF!=\"X\",IF(H85=$AB$7,ROUND(H$10*H$9*H$13*J85,2),0)+IF(K85=$AB$7,ROUND(K$10*K$9*K$13*M85,2),0)+IF(N85=$AB$7,ROUND(N$10*N$9*N$13*P85,2),0)+IF(Q85=$AB$7,ROUND(Q$10*Q$9*Q$13*S85,2),0),0)","v":{"$error":"#REF!"}},{"$f":"IF(#REF!=\"X\",IF(H85=$AC$7,ROUND(H$10*H$9*H$13*J85,2),0)+IF(K85=$AC$7,ROUND(K$10*K$9*K$13*M85,2),0)+IF(N85=$AC$7,ROUND(N$10*N$9*N$13*P85,2),0)+IF(Q85=$AC$7,ROUND(Q$10*Q$9*Q$13*S85,2),0),0)","v":{"$error":"#REF!"}},{"$f":"IF(#REF!=\"X\",IF(H85=$AD$7,ROUND(H$10*H$9*H$13*J85,2),0)+IF(K85=$AD$7,ROUND(K$10*K$9*K$13*M85,2),0)+IF(N85=$AD$7,ROUND(N$10*N$9*N$13*P85,2),0)+IF(Q85=$AD$7,ROUND(Q$10*Q$9*Q$13*S85,2),0),0)","v":{"$error":"#REF!"}}]
[1,{"$nulls":4},"QcI.11\nQe.07"," Certificato di regolare esecuzione (art.237, d.P.R. 207/2010)  ",{"$f":"IF(AND('Calcolo DM 140-12 + ORD. 108-20'!I99<9,'Calcolo DM 140-12 + ORD. 108-20'!I99>0),\"X\",\"\")","v":""},{"v":0,"d":"0.000"},{"v":0.04,"d":"0.040"},{"$f":"IF(AND('Calcolo DM 140-12 + ORD. 108-20'!L99<9,'Calcolo DM 140-12 + ORD. 108-20'!L99>0),\"X\",\"\")","v":""},{"v":0,"d":"0.000"},{"v":0.04,"d":"0.040"},{"$f":"IF(AND('Calcolo DM 140-12 + ORD. 108-20'!O99<9,'Calcolo DM 140-12 + ORD. 108-20'!O99>0),\"X\",\"\")","v":""},{"v":0,"d":"0.000"},{"v":0.04,"d":"0.040"},{"$f":"IF(AND('Calcolo DM 140-12 + ORD. 108-20'!R99<9,'Calcolo DM 140-12 + ORD. 108-20'!R99>0),\"X\",\"\")","v":""},{"v":0,"d":"0.000"},{"v":0.04,"d":"0.040"},{"$nulls":3},{"$f":"IF(#REF!=\"X\",IF(H86=$W$7,ROUND(H$10*H$9*H$13*J86,2),0)+IF(K86=$W$7,ROUND(K$10*K$9*K$13*M86,2),0)+IF(N86=$W$7,ROUND(N$10*N$9*N$13*P86,2),0)+IF(Q86=$W$7,ROUND(Q$10*Q$9*Q$13*S86,2),0),0)","v":{"$error":"#REF!"}},{"$f":"IF(#REF!=\"X\",IF(H86=$X$7,ROUND(H$10*H$9*H$13*J86,2),0)+IF(K86=$X$7,ROUND(K$10*K$9*K$13*M86,2),0)+IF(N86=$X$7,ROUND(N$10*N$9*N$13*P86,2),0)+IF(Q86=$X$7,ROUND(Q$10*Q$9*Q$13*S86,2),0),0)","v":{"$error":"#REF!"}},{"$f":"IF(#REF!=\"X\",IF(H86=$Y$7,ROUND(H$10*H$9*H$13*J86,2),0)+IF(K86=$Y$7,ROUND(K$10*K$9*K$13*M86,2),0)+IF(N86=$Y$7,ROUND(N$10*N$9*N$13*P86,2),0)+IF(Q86=$Y$7,ROUND(Q$10*Q$9*Q$13*S86,2),0),0)","v":{"$error":"#REF!"}},{"$f":"IF(#REF!=\"X\",IF(H86=$Z$7,ROUND(H$10*H$9*H$13*J86,2),0)+IF(K86=$Z$7,ROUND(K$10*K$9*K$13*M86,2),0)+IF(N86=$Z$7,ROUND(N$10*N$9*N$13*P86,2),0)+IF(Q86=$Z$7,ROUND(Q$10*Q$9*Q$13*S86,2),0),0)","v":{"$error":"#REF!"}},{"$f":"IF(#REF!=\"X\",IF(H86=$AA$7,ROUND(H$10*H$9*H$13*J86,2),0)+IF(K86=$AA$7,ROUND(K$10*K$9*K$13*M86,2),0)+IF(N86=$AA$7,ROUND(N$10*N$9*N$13*P86,2),0)+IF(Q86=$AA$7,ROUND(Q$10*Q$9*Q$13*S86,2),0),0)","v":{"$error":"#REF!"}},{"$f":"IF(#REF!=\"X\",IF(H86=$AB$7,ROUND(H$10*H$9*H$13*J86,2),0)+IF(K86=$AB$7,ROUND(K$10*K$9*K$13*M86,2),0)+IF(N86=$AB$7,ROUND(N$10*N$9*N$13*P86,2),0)+IF(Q86=$AB$7,ROUND(Q$10*Q$9*Q$13*S86,2),0),0)","v":{"$error":"#REF!"}},{"$f":"IF(#REF!=\"X\",IF(H86=$AC$7,ROUND(H$10*H$9*H$13*J86,2),0)+IF(K86=$AC$7,ROUND(K$10*K$9*K$13*M86,2),0)+IF(N86=$AC$7,ROUND(N$10*N$9*N$13*P86,2),0)+IF(Q86=$AC$7,ROUND(Q$10*Q$9*Q$13*S86,2),0),0)","v":{"$error":"#REF!"}},{"$f":"IF(#REF!=\"X\",IF(H86=$AD$7,ROUND(H$10*H$9*H$13*J86,2),0)+IF(K86=$AD$7,ROUND(K$10*K$9*K$13*M86,2),0)+IF(N86=$AD$7,ROUND(N$10*N$9*N$13*P86,2),0)+IF(Q86=$AD$7,ROUND(Q$10*Q$9*Q$13*S86,2),0),0)","v":{"$error":"#REF!"}},{"$nulls":3},"X","X","X","X"]
[1,{"$nulls":4},"QcI.12\nQS.02"," Coordinamento della sicurezza in esecuzione  ",{"$f":"IF(AND('Calcolo DM 140-12 + ORD. 108-20'!I100<9,'Calcolo DM 140-12 + ORD. 108-20'!I100>0),\"X\",\"\")","v":""},{"v":0,"d":"0.000"},{"v":0.25,"d":"0.250"},{"$f":"IF(AND('Calcolo DM 140-12 + ORD. 108-20'!L100<9,'Calcolo DM 140-12 + ORD. 108-20'!L100>0),\"X\",\"\")","v":""},{"v":0,"d":"0.000"},{"v":0.25,"d":"0.250"},{"$f":"IF(AND('Calcolo DM 140-12 + ORD. 108-20'!O100<9,'Calcolo DM 140-12 + ORD. 108-20'!O100>0),\"X\",\"\")","v":""},{"v":0,"d":"0.000"},{"v":0.25,"d":"0.250"},{"$f":"IF(AND('Calcolo DM 140-12 + ORD. 108-20'!R100<9,'Calcolo DM 140-12 + ORD. 108-20'!R100>0),\"X\",\"\")","v":""},{"v":0,"d":"0.000"},{"v":0.25,"d":"0.250"},{"$nulls":3},{"$f":"IF(#REF!=\"X\",IF(H87=$W$7,ROUND(H$10*H$9*H$13*J87,2),0)+IF(K87=$W$7,ROUND(K$10*K$9*K$13*M87,2),0)+IF(N87=$W$7,ROUND(N$10*N$9*N$13*P87,2),0)+IF(Q87=$W$7,ROUND(Q$10*Q$9*Q$13*S87,2),0),0)","v":{"$error":"#REF!"}},{"$f":"IF(#REF!=\"X\",IF(H87=$X$7,ROUND(H$10*H$9*H$13*J87,2),0)+IF(K87=$X$7,ROUND(K$10*K$9*K$13*M87,2),0)+IF(N87=$X$7,ROUND(N$10*N$9*N$13*P87,2),0)+IF(Q87=$X$7,ROUND(Q$10*Q$9*Q$13*S87,2),0),0)","v":{"$error":"#REF!"}},{"$f":"IF(#REF!=\"X\",IF(H87=$Y$7,ROUND(H$10*H$9*H$13*J87,2),0)+IF(K87=$Y$7,ROUND(K$10*K$9*K$13*M87,2),0)+IF(N87=$Y$7,ROUND(N$10*N$9*N$13*P87,2),0)+IF(Q87=$Y$7,ROUND(Q$10*Q$9*Q$13*S87,2),0),0)","v":{"$error":"#REF!"}},{"$f":"IF(#REF!=\"X\",IF(H87=$Z$7,ROUND(H$10*H$9*H$13*J87,2),0)+IF(K87=$Z$7,ROUND(K$10*K$9*K$13*M87,2),0)+IF(N87=$Z$7,ROUND(N$10*N$9*N$13*P87,2),0)+IF(Q87=$Z$7,ROUND(Q$10*Q$9*Q$13*S87,2),0),0)","v":{"$error":"#REF!"}},{"$f":"IF(#REF!=\"X\",IF(H87=$AA$7,ROUND(H$10*H$9*H$13*J87,2),0)+IF(K87=$AA$7,ROUND(K$10*K$9*K$13*M87,2),0)+IF(N87=$AA$7,ROUND(N$10*N$9*N$13*P87,2),0)+IF(Q87=$AA$7,ROUND(Q$10*Q$9*Q$13*S87,2),0),0)","v":{"$error":"#REF!"}},{"$f":"IF(#REF!=\"X\",IF(H87=$AB$7,ROUND(H$10*H$9*H$13*J87,2),0)+IF(K87=$AB$7,ROUND(K$10*K$9*K$13*M87,2),0)+IF(N87=$AB$7,ROUND(N$10*N$9*N$13*P87,2),0)+IF(Q87=$AB$7,ROUND(Q$10*Q$9*Q$13*S87,2),0),0)","v":{"$error":"#REF!"}},{"$f":"IF(#REF!=\"X\",IF(H87=$AC$7,ROUND(H$10*H$9*H$13*J87,2),0)+IF(K87=$AC$7,ROUND(K$10*K$9*K$13*M87,2),0)+IF(N87=$AC$7,ROUND(N$10*N$9*N$13*P87,2),0)+IF(Q87=$AC$7,ROUND(Q$10*Q$9*Q$13*S87,2),0),0)","v":{"$error":"#REF!"}},{"$f":"IF(#REF!=\"X\",IF(H87=$AD$7,ROUND(H$10*H$9*H$13*J87,2),0)+IF(K87=$AD$7,ROUND(K$10*K$9*K$13*M87,2),0)+IF(N87=$AD$7,ROUND(N$10*N$9*N$13*P87,2),0)+IF(Q87=$AD$7,ROUND(Q$10*Q$9*Q$13*S87,2),0),0)","v":{"$error":"#REF!"}},{"$nulls":3},"X","X","X","X"]
[{"$f":"IF(OR(J88<>0,M88<>0,P88<>0,S88<>0),\"\",1)","v":1},"totale incidenze",{"$nulls":3},"∑ Q i",null,null,{"$f":"SUM(I76:I87)","v":{"v":0,"d":"0.000"}},{"$f":"I88","v":{"v":0,"d":"0.000"}},null,{"$f":"SUM(L76:L87)","v":{"v":0,"d":"0.000"}},{"$f":"L88","v":{"v":0,"d":"0.000"}},null,{"$f":"SUM(O76:O87)","v":{"v":0,"d":"0.000"}},{"$f":"O88","v":{"v":0,"d":"0.000"}},null,{"$f":"SUM(R76:R87)","v":{"v":0,"d":"0.000"}},{"$f":"R88","v":{"v":0,"d":"0.000"}},{"$nulls":12},{"$f":"H90-SUM(W76:AD87)","v":{"$error":"#REF!"}}]
[{"$f":"IF(OR(H89<>0,K89<>0,N89<>0,Q89<>0),\"\",1)","v":1},"Compenso al netto di spese ed oneri CNPAIA ",{"$nulls":3},"V*P*G*ΣQ",null,{"$f":"J88*H9*H10*H13","v":{"v":0,"d":"0.00 €"}},null,null,{"$f":"M88*K9*K10*K13","v":{"v":0,"d":"0.00 €"}},null,null,{"$f":"P88*N9*N10*N13","v":{"v":0,"d":"0.00 €"}},null,null,{"$f":"S88*Q9*Q10*Q13","v":{"v":0,"d":"0.00 €"}},{"$nulls":3},"eventuale aggiustamento\ndx-sx",null,{"$f":"AF88","v":{"$error":"#REF!"}}]
[null,"COMPENSO AL NETTO DELLE SPESE",{"$nulls":5},{"$f":"ROUND(SUM(H89:S89),2)","v":{"v":0,"d":"0.00 €"}},{"$nulls":12},{"$f":"IF(H90=SUM(W90:AD90),\"OK\",\"CONTROLLA\")","v":{"$error":"#REF!"}},{"$f":"SUM(W90:AD90)-H90","v":{"$error":"#REF!"}},{"$f":"SUM(W76:W89)","v":{"$error":"#REF!"}},{"$error":"#REF!"},{"$error":"#REF!"},{"$error":"#REF!"},{"$error":"#REF!"},{"$error":"#REF!"},{"$error":"#REF!"},{"$error":"#REF!"}]
[]
[null,"VERIFICHE E COLLAUDI",{"$nulls":5},"Edilizia",null,null,"Strutture",null,null,"Impianto Elettrico",null,null,"Impianto Termo-Idrau",{"$nulls":5},"VERIFICHE E COLLAUDI"]
[{"$f":"IF(OR(H93<>\"\",K93<>\"\",N93<>\"\"),\"\",1)","v":1}," Verifiche e Collaudi "," d.I)VERIFICHE E COLLAUDI  ","prestazioni affidate","incidenza Q"," QdI.01  "," Collaudo tecnico amministrativo (Parte II, Titolo X, d.P.R. 207/10) 11  ",{"$f":"IF(AND('Calcolo DM 140-12 + ORD. 108-20'!I106<9,'Calcolo DM 140-12 + ORD. 108-20'!I106>0),\"X\",\"\")","v":""},{"$f":"IF(H93=\"X\",J93,0)","v":{"v":0,"d":"0.000"}},{"v":0.08,"d":"0.080"},{"$f":"IF(AND('Calcolo DM 140-12 + ORD. 108-20'!L106<9,'Calcolo DM 140-12 + ORD. 108-20'!L106>0),\"X\",\"\")","v":""},{"$f":"IF(K93=\"X\",M93,0)","v":{"v":0,"d":"0.000"}},{"v":0.08,"d":"0.080"},{"$f":"IF(AND('Calcolo DM 140-12 + ORD. 108-20'!O106<9,'Calcolo DM 140-12 + ORD. 108-20'!O106>0),\"X\",\"\")","v":""},{"$f":"IF(N93=\"X\",P93,0)","v":{"v":0,"d":"0.000"}},{"v":0.08,"d":"0.080"},{"$nulls":6},{"$f":"IF(#REF!=\"X\",IF(H93=$W$7,ROUND(H$10*H$9*H$13*J93,2),0)+IF(K93=$W$7,ROUND(K$10*K$9*K$13*M93,2),0)+IF(N93=$W$7,ROUND(N$10*N$9*N$13*P93,2),0)+IF(Q93=$W$7,ROUND(Q$10*Q$9*Q$13*S93,2),0),0)","v":{"$error":"#REF!"}},{"$f":"IF(#REF!=\"X\",IF(H93=$X$7,ROUND(H$10*H$9*H$13*J93,2),0)+IF(K93=$X$7,ROUND(K$10*K$9*K$13*M93,2),0)+IF(N93=$X$7,ROUND(N$10*N$9*N$13*P93,2),0)+IF(Q93=$X$7,ROUND(Q$10*Q$9*Q$13*S93,2),0),0)","v":{"$error":"#REF!"}},{"$f":"IF(#REF!=\"X\",IF(H93=$Y$7,ROUND(H$10*H$9*H$13*J93,2),0)+IF(K93=$Y$7,ROUND(K$10*K$9*K$13*M93,2),0)+IF(N93=$Y$7,ROUND(N$10*N$9*N$13*P93,2),0)+IF(Q93=$Y$7,ROUND(Q$10*Q$9*Q$13*S93,2),0),0)","v":{"$error":"#REF!"}},{"$f":"IF(#REF!=\"X\",IF(H93=$Z$7,ROUND(H$10*H$9*H$13*J93,2),0)+IF(K93=$Z$7,ROUND(K$10*K$9*K$13*M93,2),0)+IF(N93=$Z$7,ROUND(N$10*N$9*N$13*P93,2),0)+IF(Q93=$Z$7,ROUND(Q$10*Q$9*Q$13*S93,2),0),0)","v":{"$error":"#REF!"}},{"$f":"IF(#REF!=\"X\",IF(H93=$AA$7,ROUND(H$10*H$9*H$13*J93,2),0)+IF(K93=$AA$7,ROUND(K$10*K$9*K$13*M93,2),0)+IF(N93=$AA$7,ROUND(N$10*N$9*N$13*P93,2),0)+IF(Q93=$AA$7,ROUND(Q$10*Q$9*Q$13*S93,2),0),0)","v":{"$error":"#REF!"}},{"$f":"IF(#REF!=\"X\",IF(H93=$AB$7,ROUND(H$10*H$9*H$13*J93,2),0)+IF(K93=$AB$7,ROUND(K$10*K$9*K$13*M93,2),0)+IF(N93=$AB$7,ROUND(N$10*N$9*N$13*P93,2),0)+IF(Q93=$AB$7,ROUND(Q$10*Q$9*Q$13*S93,2),0),0)","v":{"$error":"#REF!"}},{"$f":"IF(#REF!=\"X\",IF(H93=$AC$7,ROUND(H$10*H$9*H$13*J93,2),0)+IF(K93=$AC$7,ROUND(K$10*K$9*K$13*M93,2),0)+IF(N93=$AC$7,ROUND(N$10*N$9*N$13*P93,2),0)+IF(Q93=$AC$7,ROUND(Q$10*Q$9*Q$13*S93,2),0),0)","v":{"$error":"#REF!"}},{"$f":"IF(#REF!=\"X\",IF(H93=$AD$7,ROUND(H$10*H$9*H$13*J93,2),0)+IF(K93=$AD$7,ROUND(K$10*K$9*K$13*M93,2),0)+IF(N93=$AD$7,ROUND(N$10*N$9*N$13*P93,2),0)+IF(Q93=$AD$7,ROUND(Q$10*Q$9*Q$13*S93,2),0),0)","v":{"$error":"#REF!"}}]
[{"$f":"IF(OR(H94<>\"\",K94<>\"\",N94<>\"\"),\"\",1)","v":1},{"$nulls":4}," QdI.02  "," Revisione tecnico contabile (Parte II, Titolo X, d.P.R. 207/10)  ",{"$f":"IF(AND('Calcolo DM 140-12 + ORD. 108-20'!I107<9,'Calcolo DM 140-12 + ORD. 108-20'!I107>0),\"X\",\"\")","v":""},{"v":0,"d":"0.000"},{"v":0.02,"d":"0.020"},{"$f":"IF(AND('Calcolo DM 140-12 + ORD. 108-20'!L107<9,'Calcolo DM 140-12 + ORD. 108-20'!L107>0),\"X\",\"\")","v":""},{"v":0,"d":"0.000"},{"v":0.02,"d":"0.020"},{"$f":"IF(AND('Calcolo DM 140-12 + ORD. 108-20'!O107<9,'Calcolo DM 140-12 + ORD. 108-20'!O107>0),\"X\",\"\")","v":""},{"v":0,"d":"0.000"},{"v":0.02,"d":"0.020"},{"$nulls":6},{"$f":"IF(#REF!=\"X\",IF(H94=$W$7,ROUND(H$10*H$9*H$13*J94,2),0)+IF(K94=$W$7,ROUND(K$10*K$9*K$13*M94,2),0)+IF(N94=$W$7,ROUND(N$10*N$9*N$13*P94,2),0)+IF(Q94=$W$7,ROUND(Q$10*Q$9*Q$13*S94,2),0),0)","v":{"$error":"#REF!"}},{"$f":"IF(#REF!=\"X\",IF(H94=$X$7,ROUND(H$10*H$9*H$13*J94,2),0)+IF(K94=$X$7,ROUND(K$10*K$9*K$13*M94,2),0)+IF(N94=$X$7,ROUND(N$10*N$9*N$13*P94,2),0)+IF(Q94=$X$7,ROUND(Q$10*Q$9*Q$13*S94,2),0),0)","v":{"$error":"#REF!"}},{"$f":"IF(#REF!=\"X\",IF(H94=$Y$7,ROUND(H$10*H$9*H$13*J94,2),0)+IF(K94=$Y$7,ROUND(K$10*K$9*K$13*M94,2),0)+IF(N94=$Y$7,ROUND(N$10*N$9*N$13*P94,2),0)+IF(Q94=$Y$7,ROUND(Q$10*Q$9*Q$13*S94,2),0),0)","v":{"$error":"#REF!"}},{"$f":"IF(#REF!=\"X\",IF(H94=$Z$7,ROUND(H$10*H$9*H$13*J94,2),0)+IF(K94=$Z$7,ROUND(K$10*K$9*K$13*M94,2),0)+IF(N94=$Z$7,ROUND(N$10*N$9*N$13*P94,2),0)+IF(Q94=$Z$7,ROUND(Q$10*Q$9*Q$13*S94,2),0),0)","v":{"$error":"#REF!"}},{"$f":"IF(#REF!=\"X\",IF(H94=$AA$7,ROUND(H$10*H$9*H$13*J94,2),0)+IF(K94=$AA$7,ROUND(K$10*K$9*K$13*M94,2),0)+IF(N94=$AA$7,ROUND(N$10*N$9*N$13*P94,2),0)+IF(Q94=$AA$7,ROUND(Q$10*Q$9*Q$13*S94,2),0),0)","v":{"$error":"#REF!"}},{"$f":"IF(#REF!=\"X\",IF(H94=$AB$7,ROUND(H$10*H$9*H$13*J94,2),0)+IF(K94=$AB$7,ROUND(K$10*K$9*K$13*M94,2),0)+IF(N94=$AB$7,ROUND(N$10*N$9*N$13*P94,2),0)+IF(Q94=$AB$7,ROUND(Q$10*Q$9*Q$13*S94,2),0),0)","v":{"$error":"#REF!"}},{"$f":"IF(#REF!=\"X\",IF(H94=$AC$7,ROUND(H$10*H$9*H$13*J94,2),0)+IF(K94=$AC$7,ROUND(K$10*K$9*K$13*M94,2),0)+IF(N94=$AC$7,ROUND(N$10*N$9*N$13*P94,2),0)+IF(Q94=$AC$7,ROUND(Q$10*Q$9*Q$13*S94,2),0),0)","v":{"$error":"#REF!"}},{"$f":"IF(#REF!=\"X\",IF(H94=$AD$7,ROUND(H$10*H$9*H$13*J94,2),0)+IF(K94=$AD$7,ROUND(K$10*K$9*K$13*M94,2),0)+IF(N94=$AD$7,ROUND(N$10*N$9*N$13*P94,2),0)+IF(Q94=$AD$7,ROUND(Q$10*Q$9*Q$13*S94,2),0),0)","v":{"$error":"#REF!"}}]
[{"$f":"IF(K95<>\"\",\"\",1)","v":1},{"$nulls":4},"QdI.04\nQc.04"," Collaudo statico (Capitolo 9, d.m. 14/01/2008)  ",{"$nulls":3},{"$f":"IF(AND('Calcolo DM 140-12 + ORD. 108-20'!L108<9,'Calcolo DM 140-12 + ORD. 108-20'!L108>0),\"X\",\"\")","v":""},{"v":0,"d":"0.000"},{"v":0.22,"d":"0.220"},{"$nulls":9},{"$f":"IF(#REF!=\"X\",IF(H95=$W$7,ROUND(H$10*H$9*H$13*J95,2),0)+IF(K95=$W$7,ROUND(K$10*K$9*K$13*M95,2),0)+IF(N95=$W$7,ROUND(N$10*N$9*N$13*P95,2),0)+IF(Q95=$W$7,ROUND(Q$10*Q$9*Q$13*S95,2),0),0)","v":{"$error":"#REF!"}},{"$f":"IF(#REF!=\"X\",IF(H95=$X$7,ROUND(H$10*H$9*H$13*J95,2),0)+IF(K95=$X$7,ROUND(K$10*K$9*K$13*M95,2),0)+IF(N95=$X$7,ROUND(N$10*N$9*N$13*P95,2),0)+IF(Q95=$X$7,ROUND(Q$10*Q$9*Q$13*S95,2),0),0)","v":{"$error":"#REF!"}},{"$f":"IF(#REF!=\"X\",IF(H95=$Y$7,ROUND(H$10*H$9*H$13*J95,2),0)+IF(K95=$Y$7,ROUND(K$10*K$9*K$13*M95,2),0)+IF(N95=$Y$7,ROUND(N$10*N$9*N$13*P95,2),0)+IF(Q95=$Y$7,ROUND(Q$10*Q$9*Q$13*S95,2),0),0)","v":{"$error":"#REF!"}},{"$f":"IF(#REF!=\"X\",IF(H95=$Z$7,ROUND(H$10*H$9*H$13*J95,2),0)+IF(K95=$Z$7,ROUND(K$10*K$9*K$13*M95,2),0)+IF(N95=$Z$7,ROUND(N$10*N$9*N$13*P95,2),0)+IF(Q95=$Z$7,ROUND(Q$10*Q$9*Q$13*S95,2),0),0)","v":{"$error":"#REF!"}},{"$f":"IF(#REF!=\"X\",IF(H95=$AA$7,ROUND(H$10*H$9*H$13*J95,2),0)+IF(K95=$AA$7,ROUND(K$10*K$9*K$13*M95,2),0)+IF(N95=$AA$7,ROUND(N$10*N$9*N$13*P95,2),0)+IF(Q95=$AA$7,ROUND(Q$10*Q$9*Q$13*S95,2),0),0)","v":{"$error":"#REF!"}},{"$f":"IF(#REF!=\"X\",IF(H95=$AB$7,ROUND(H$10*H$9*H$13*J95,2),0)+IF(K95=$AB$7,ROUND(K$10*K$9*K$13*M95,2),0)+IF(N95=$AB$7,ROUND(N$10*N$9*N$13*P95,2),0)+IF(Q95=$AB$7,ROUND(Q$10*Q$9*Q$13*S95,2),0),0)","v":{"$error":"#REF!"}},{"$f":"IF(#REF!=\"X\",IF(H95=$AC$7,ROUND(H$10*H$9*H$13*J95,2),0)+IF(K95=$AC$7,ROUND(K$10*K$9*K$13*M95,2),0)+IF(N95=$AC$7,ROUND(N$10*N$9*N$13*P95,2),0)+IF(Q95=$AC$7,ROUND(Q$10*Q$9*Q$13*S95,2),0),0)","v":{"$error":"#REF!"}},{"$f":"IF(#REF!=\"X\",IF(H95=$AD$7,ROUND(H$10*H$9*H$13*J95,2),0)+IF(K95=$AD$7,ROUND(K$10*K$9*K$13*M95,2),0)+IF(N95=$AD$7,ROUND(N$10*N$9*N$13*P95,2),0)+IF(Q95=$AD$7,ROUND(Q$10*Q$9*Q$13*S95,2),0),0)","v":{"$error":"#REF!"}},{"$nulls":3},"X","X","X"]
[{"$f":"IF(N96<>\"\",\"\",1)","v":1},{"$nulls":4},"QdI.05\nQc.05"," Collaudo tecnico funzionale degli impianti (d.m. 22/01/2008 n°37)  ",{"$nulls":6},{"$f":"IF(AND('Calcolo DM 140-12 + ORD. 108-20'!O109<9,'Calcolo DM 140-12 + ORD. 108-20'!O109>0),\"X\",\"\")","v":""},{"$f":"IF(N96=\"X\",P96,0)","v":{"v":0,"d":"0.000"}},{"v":0.18,"d":"0.180"},{"$nulls":6},{"$f":"IF(#REF!=\"X\",IF(H96=$W$7,ROUND(H$10*H$9*H$13*J96,2),0)+IF(K96=$W$7,ROUND(K$10*K$9*K$13*M96,2),0)+IF(N96=$W$7,ROUND(N$10*N$9*N$13*P96,2),0)+IF(Q96=$W$7,ROUND(Q$10*Q$9*Q$13*S96,2),0),0)","v":{"$error":"#REF!"}},{"$f":"IF(#REF!=\"X\",IF(H96=$X$7,ROUND(H$10*H$9*H$13*J96,2),0)+IF(K96=$X$7,ROUND(K$10*K$9*K$13*M96,2),0)+IF(N96=$X$7,ROUND(N$10*N$9*N$13*P96,2),0)+IF(Q96=$X$7,ROUND(Q$10*Q$9*Q$13*S96,2),0),0)","v":{"$error":"#REF!"}},{"$f":"IF(#REF!=\"X\",IF(H96=$Y$7,ROUND(H$10*H$9*H$13*J96,2),0)+IF(K96=$Y$7,ROUND(K$10*K$9*K$13*M96,2),0)+IF(N96=$Y$7,ROUND(N$10*N$9*N$13*P96,2),0)+IF(Q96=$Y$7,ROUND(Q$10*Q$9*Q$13*S96,2),0),0)","v":{"$error":"#REF!"}},{"$f":"IF(#REF!=\"X\",IF(H96=$Z$7,ROUND(H$10*H$9*H$13*J96,2),0)+IF(K96=$Z$7,ROUND(K$10*K$9*K$13*M96,2),0)+IF(N96=$Z$7,ROUND(N$10*N$9*N$13*P96,2),0)+IF(Q96=$Z$7,ROUND(Q$10*Q$9*Q$13*S96,2),0),0)","v":{"$error":"#REF!"}},{"$f":"IF(#REF!=\"X\",IF(H96=$AA$7,ROUND(H$10*H$9*H$13*J96,2),0)+IF(K96=$AA$7,ROUND(K$10*K$9*K$13*M96,2),0)+IF(N96=$AA$7,ROUND(N$10*N$9*N$13*P96,2),0)+IF(Q96=$AA$7,ROUND(Q$10*Q$9*Q$13*S96,2),0),0)","v":{"$error":"#REF!"}},{"$f":"IF(#REF!=\"X\",IF(H96=$AB$7,ROUND(H$10*H$9*H$13*J96,2),0)+IF(K96=$AB$7,ROUND(K$10*K$9*K$13*M96,2),0)+IF(N96=$AB$7,ROUND(N$10*N$9*N$13*P96,2),0)+IF(Q96=$AB$7,ROUND(Q$10*Q$9*Q$13*S96,2),0),0)","v":{"$error":"#REF!"}},{"$f":"IF(#REF!=\"X\",IF(H96=$AC$7,ROUND(H$10*H$9*H$13*J96,2),0)+IF(K96=$AC$7,ROUND(K$10*K$9*K$13*M96,2),0)+IF(N96=$AC$7,ROUND(N$10*N$9*N$13*P96,2),0)+IF(Q96=$AC$7,ROUND(Q$10*Q$9*Q$13*S96,2),0),0)","v":{"$error":"#REF!"}},{"$f":"IF(#REF!=\"X\",IF(H96=$AD$7,ROUND(H$10*H$9*H$13*J96,2),0)+IF(K96=$AD$7,ROUND(K$10*K$9*K$13*M96,2),0)+IF(N96=$AD$7,ROUND(N$10*N$9*N$13*P96,2),0)+IF(Q96=$AD$7,ROUND(Q$10*Q$9*Q$13*S96,2),0),0)","v":{"$error":"#REF!"}}]
[{"$f":"IF(OR(H97<>\"\",K97<>\"\",N97<>\"\"),\"\",1)","v":1},{"$nulls":4},"QdI.06\nQc.06"," Attestato di certificazione energetica (art.6 d.lgs. 311/2006) – Attestato di collaudo e certificazioni di qualità  ",{"$f":"IF(AND('Calcolo DM 140-12 + ORD. 108-20'!I110<9,'Calcolo DM 140-12 + ORD. 108-20'!I110>0),\"X\",\"\")","v":""},{"$f":"IF(H97=\"X\",J97,0)","v":{"v":0,"d":"0.000"}},{"v":0.05,"d":"0.050"},{"$f":"IF(AND('Calcolo DM 140-12 + ORD. 108-20'!L110<9,'Calcolo DM 140-12 + ORD. 108-20'!L110>0),\"X\",\"\")","v":""},{"v":0,"d":"0.000"},{"v":0.05,"d":"0.050"},{"$f":"IF(AND('Calcolo DM 140-12 + ORD. 108-20'!O110<9,'Calcolo DM 140-12 + ORD. 108-20'!O110>0),\"X\",\"\")","v":""},{"$f":"IF(N97=\"X\",P97,0)","v":{"v":0,"d":"0.000"}},{"v":0.05,"d":"0.050"},{"$nulls":6},{"$f":"IF(#REF!=\"X\",IF(H97=$W$7,ROUND(H$10*H$9*H$13*J97,2),0)+IF(K97=$W$7,ROUND(K$10*K$9*K$13*M97,2),0)+IF(N97=$W$7,ROUND(N$10*N$9*N$13*P97,2),0)+IF(Q97=$W$7,ROUND(Q$10*Q$9*Q$13*S97,2),0),0)","v":{"$error":"#REF!"}},{"$f":"IF(#REF!=\"X\",IF(H97=$X$7,ROUND(H$10*H$9*H$13*J97,2),0)+IF(K97=$X$7,ROUND(K$10*K$9*K$13*M97,2),0)+IF(N97=$X$7,ROUND(N$10*N$9*N$13*P97,2),0)+IF(Q97=$X$7,ROUND(Q$10*Q$9*Q$13*S97,2),0),0)","v":{"$error":"#REF!"}},{"$f":"IF(#REF!=\"X\",IF(H97=$Y$7,ROUND(H$10*H$9*H$13*J97,2),0)+IF(K97=$Y$7,ROUND(K$10*K$9*K$13*M97,2),0)+IF(N97=$Y$7,ROUND(N$10*N$9*N$13*P97,2),0)+IF(Q97=$Y$7,ROUND(Q$10*Q$9*Q$13*S97,2),0),0)","v":{"$error":"#REF!"}},{"$f":"IF(#REF!=\"X\",IF(H97=$Z$7,ROUND(H$10*H$9*H$13*J97,2),0)+IF(K97=$Z$7,ROUND(K$10*K$9*K$13*M97,2),0)+IF(N97=$Z$7,ROUND(N$10*N$9*N$13*P97,2),0)+IF(Q97=$Z$7,ROUND(Q$10*Q$9*Q$13*S97,2),0),0)","v":{"$error":"#REF!"}},{"$f":"IF(#REF!=\"X\",IF(H97=$AA$7,ROUND(H$10*H$9*H$13*J97,2),0)+IF(K97=$AA$7,ROUND(K$10*K$9*K$13*M97,2),0)+IF(N97=$AA$7,ROUND(N$10*N$9*N$13*P97,2),0)+IF(Q97=$AA$7,ROUND(Q$10*Q$9*Q$13*S97,2),0),0)","v":{"$error":"#REF!"}},{"$f":"IF(#REF!=\"X\",IF(H97=$AB$7,ROUND(H$10*H$9*H$13*J97,2),0)+IF(K97=$AB$7,ROUND(K$10*K$9*K$13*M97,2),0)+IF(N97=$AB$7,ROUND(N$10*N$9*N$13*P97,2),0)+IF(Q97=$AB$7,ROUND(Q$10*Q$9*Q$13*S97,2),0),0)","v":{"$error":"#REF!"}},{"$f":"IF(#REF!=\"X\",IF(H97=$AC$7,ROUND(H$10*H$9*H$13*J97,2),0)+IF(K97=$AC$7,ROUND(K$10*K$9*K$13*M97,2),0)+IF(N97=$AC$7,ROUND(N$10*N$9*N$13*P97,2),0)+IF(Q97=$AC$7,ROUND(Q$10*Q$9*Q$13*S97,2),0),0)","v":{"$error":"#REF!"}},{"$f":"IF(#REF!=\"X\",IF(H97=$AD$7,ROUND(H$10*H$9*H$13*J97,2),0)+IF(K97=$AD$7,ROUND(K$10*K$9*K$13*M97,2),0)+IF(N97=$AD$7,ROUND(N$10*N$9*N$13*P97,2),0)+IF(Q97=$AD$7,ROUND(Q$10*Q$9*Q$13*S97,2),0),0)","v":{"$error":"#REF!"}}]
[{"$f":"IF(OR(J98<>0,M98<>0,P98<>0,S98<>0),\"\",1)","v":1},"totale incidenze",{"$nulls":3},"∑ Q i",null,null,{"$f":"SUM(I93:I97)","v":{"v":0,"d":"0.000"}},{"$f":"I98","v":{"v":0,"d":"0.000"}},null,{"$f":"SUM(L93:L97)","v":{"v":0,"d":"0.000"}},{"$f":"L98","v":{"v":0,"d":"0.000"}},null,{"$f":"SUM(O93:O97)","v":{"v":0,"d":"0.000"}},{"$f":"O98","v":{"v":0,"d":"0.000"}},null,{"$f":"SUM(R93:R97)","v":{"v":0,"d":"0.000"}},{"$f":"R98","v":{"v":0,"d":"0.000"}},{"$nulls":12},{"$f":"H100-SUM(W93:AD97)","v":{"$error":"#REF!"}}]
[{"$f":"IF(OR(H99<>0,K99<>0,N99<>0,Q99<>0),\"\",1)","v":1},"Compenso al netto di spese ed oneri CNPAIA",{"$nulls":3},"V*P*G*ΣQ",null,{"$f":"J98*H9*H10*H13","v":{"v":0,"d":"0.00 €"}},null,null,{"$f":"M98*K9*K10*K13","v":{"v":0,"d":"0.00 €"}},null,null,{"$f":"P98*N9*N10*N13","v":{"v":0,"d":"0.00 €"}},null,null,{"$f":"S98*Q9*Q10*Q13","v":{"v":0,"d":"0.00 €"}},{"$nulls":3},"eventuale aggiustamento\ndx-sx",null,{"$f":"AF98","v":{"$error":"#REF!"}}]
[null,"COMPENSO AL NETTO DELLE SPESE",{"$nulls":5},{"$f":"ROUND(SUM(H99:S99),2)","v":{"v":0,"d":"0.00 €"}},{"$nulls":12},{"$f":"IF(H100=SUM(W100:AD100),\"OK\",\"CONTROLLA\")","v":{"$error":"#REF!"}},{"$f":"SUM(W100:AD100)-H100","v":{"$error":"#REF!"}},{"$f":"SUM(W93:W99)","v":{"$error":"#REF!"}},{"$f":"SUM(X93:X99)","v":{"$error":"#REF!"}},{"$error":"#REF!"},{"$error":"#REF!"},{"$error":"#REF!"},{"$error":"#REF!"},{"$error":"#REF!"},{"$error":"#REF!"}]
[]
[null,"progetto preliminare",{"$nulls":6},{"$f":"'Calcolo DM 140-12 + ORD. 108-20'!I115:T115","v":{"v":0,"d":"0.00 €"}},{"$nulls":11},{"$f":"IF(I102=SUM(W102:AD102),\"OK\",\"CONTROLLA\")","v":{"$error":"#REF!"}},{"$f":"SUM(W102:AD102)","v":{"$error":"#REF!"}},{"$f":"W35","v":{"$error":"#REF!"}},{"$error":"#REF!"},{"$error":"#REF!"},{"$error":"#REF!"},{"$error":"#REF!"},{"$error":"#REF!"},{"$error":"#REF!"},{"$error":"#REF!"}]
[null,"progetto definitivo",{"$nulls":6},{"$f":"'Calcolo DM 140-12 + ORD. 108-20'!I116:T116","v":{"v":0,"d":"0.00 €"}},{"$nulls":11},{"$f":"IF(I103=SUM(W103:AD103),\"OK\",\"CONTROLLA\")","v":{"$error":"#REF!"}},{"$error":"#REF!"},{"$f":"W61","v":{"$error":"#REF!"}},{"$error":"#REF!"},{"$error":"#REF!"},{"$error":"#REF!"},{"$error":"#REF!"},{"$error":"#REF!"},{"$error":"#REF!"},{"$error":"#REF!"}]
[null,"progetto esecutivo",{"$nulls":6},{"$f":"'Calcolo DM 140-12 + ORD. 108-20'!I117:T117","v":{"v":0,"d":"0.00 €"}},{"$nulls":11},{"$f":"IF(I104=SUM(W104:AD104),\"OK\",\"CONTROLLA\")","v":{"$error":"#REF!"}},{"$error":"#REF!"},{"$f":"W73","v":{"$error":"#REF!"}},{"$error":"#REF!"},{"$error":"#REF!"},{"$error":"#REF!"},{"$error":"#REF!"},{"$error":"#REF!"},{"$error":"#REF!"},{"$error":"#REF!"}]
[null,"COMPENSO FASE PROGETTAZIONE",{"$nulls":6},{"$f":"'Calcolo DM 140-12 + ORD. 108-20'!I118:T118","v":{"v":0,"d":"0.00 €"}},{"$nulls":12},{"$error":"#REF!"},{"$f":"SUM(W102:W104)","v":{"$error":"#REF!"}},{"$f":"SUM(X102:X104)","v":{"$error":"#REF!"}},{"$error":"#REF!"},{"$error":"#REF!"},{"$error":"#REF!"},{"$error":"#REF!"},{"$error":"#REF!"},{"$error":"#REF!"}]
[null,"COMPENSO FASE ESECUZIONE",{"$nulls":6},{"$f":"'Calcolo DM 140-12 + ORD. 108-20'!I119:T119","v":{"v":0,"d":"0.00 €"}},{"$nulls":11},{"$f":"IF(I106=SUM(W106:AD106),\"OK\",\"CONTROLLA\")","v":{"$error":"#REF!"}},{"$error":"#REF!"},{"$f":"W90","v":{"$error":"#REF!"}},{"$error":"#REF!"},{"$error":"#REF!"},{"$error":"#REF!"},{"$error":"#REF!"},{"$error":"#REF!"},{"$error":"#REF!"},{"$error":"#REF!"}]
[null,"COMPENSO VERIFICHE E COLLAUDI",{"$nulls":6},{"$f":"'Calcolo DM 140-12 + ORD. 108-20'!I120:T120","v":{"v":0,"d":"0.00 €"}},{"$nulls":11},{"$f":"IF(I107=SUM(W107:AD107),\"OK\",\"CONTROLLA\")","v":{"$error":"#REF!"}},{"$error":"#REF!"},{"$f":"W100","v":{"$error":"#REF!"}},{"$error":"#REF!"},{"$error":"#REF!"},{"$error":"#REF!"},{"$error":"#REF!"},{"$error":"#REF!"},{"$error":"#REF!"},{"$error":"#REF!"}]
[]
[null,"TOTALE COMPENSO",{"$nulls":6},{"$f":"'Calcolo DM 140-12 + ORD. 108-20'!I122:T122","v":{"v":0,"d":"0.00 €"}},{"$nulls":11},{"$f":"IF(I109=SUM(W109:AD109),\"OK\",\"CONTROLLA\")","v":{"$error":"#REF!"}},{"$f":"SUM(W109:AD109)","v":{"$error":"#REF!"}},{"$f":"W107+W106+W105","v":{"$error":"#REF!"}},{"$f":"X107+X106+X105","v":{"$error":"#REF!"}},{"$error":"#REF!"},{"$error":"#REF!"},{"$error":"#REF!"},{"$error":"#REF!"},{"$error":"#REF!"},{"$error":"#REF!"}]
[]
[null,"Riduzione del compenso \n(min secondo ordinanza 108/2020)",{"$nulls":5},{"$f":"'Calcolo DM 140-12 + ORD. 108-20'!H124","v":{"v":0.3,"d":"30%"}},{"$f":"'Calcolo DM 140-12 + ORD. 108-20'!I124:T124","v":{"v":0,"d":"0.00 €"}},{"$nulls":11},{"$f":"IF(I111=SUM(W111:AD111),\"OK\",\"CONTROLLA\")","v":{"$error":"#REF!"}},{"$f":"SUM(W111:AD111)","v":{"$error":"#REF!"}},{"$f":"-W109*0.3","v":{"$error":"#REF!"}},{"$f":"-X109*0.3","v":{"$error":"#REF!"}},{"$error":"#REF!"},{"$error":"#REF!"},{"$error":"#REF!"},{"$error":"#REF!"},{"$error":"#REF!"},{"$error":"#REF!"}]
[{"$f":"IF('Calcolo DM 140-12 + ORD. 108-20'!I125<>\"\",\"\",1)","v":1},"RSL",{"$nulls":3},"Prestazione all’analisi della risposta sismica locale. Comprensiva di tutte le attività inerenti la definizione del modello geologico e sismostratigrafico con indicati i parametri necessari per la definizione dell’azione sismica di progetto e l’eventuale verifica di cui all’ordinanza n. 55. Pari a 0,5% del valore dell'opera.",null,null,{"$f":"'Calcolo DM 140-12 + ORD. 108-20'!K125","v":{"v":0,"d":"0.00 €"}},{"$nulls":13},{"$f":"IF(#REF!=\"X\",IF(H112=1,#REF!,0),0)","v":{"$error":"#REF!"}},{"$f":"IF(#REF!=\"X\",IF(H112=2,#REF!,0),0)","v":{"$error":"#REF!"}},{"$f":"IF(#REF!=\"X\",IF(H112=3,#REF!,0),0)","v":{"$error":"#REF!"}},{"$f":"IF(#REF!=\"X\",IF(H112=4,#REF!,0),0)","v":{"$error":"#REF!"}},{"$f":"IF(#REF!=\"X\",IF(H112=5,#REF!,0),0)","v":{"$error":"#REF!"}},{"$f":"IF(#REF!=\"X\",IF(H112=6,#REF!,0),0)","v":{"$error":"#REF!"}},{"$f":"IF(#REF!=\"X\",IF(H112=7,#REF!,0),0)","v":{"$error":"#REF!"}},{"$f":"IF(#REF!=\"X\",IF(H112=8,#REF!,0),0)","v":{"$error":"#REF!"}}]
[null,"SPESE SU COMPENSO\n(suggerito massimo secondo ordinanza 108 - modificabile)",{"$nulls":5},{"v":0.2,"d":"20%"},{"$f":"'Calcolo DM 140-12 + ORD. 108-20'!I126:T126","v":{"v":0,"d":"0.00 €"}}]
[]
[null,"TOTALE CORRISPETTIVO  SOGGETO A IVA E CNPAIA",{"$nulls":6},{"$f":"'Calcolo DM 140-12 + ORD. 108-20'!I128:T128","v":{"v":0,"d":"0.00 €"}},{"$nulls":11},{"$f":"IF(I115=SUM(W115:AD115),\"OK\",\"CONTROLLA\")","v":{"$error":"#REF!"}},{"$f":"SUM(W115:AD115)","v":{"$error":"#REF!"}},{"$f":"W109+W111+W112","v":{"$error":"#REF!"}},{"$f":"X109+X111+X112","v":{"$error":"#REF!"}},{"$error":"#REF!"},{"$error":"#REF!"},{"$error":"#REF!"},{"$error":"#REF!"},{"$error":"#REF!"},{"$error":"#REF!"}]
[null,"MASSIME SPESE RENDICONTABILI IN SEDE DI SAL",{"$nulls":6},{"$f":"I113","v":{"v":0,"d":"0.00 €"}}]
[]
[null,"(1) L'importo del corrispettivo è inteso al netto degli oneri fiscali e previdenziali dovuti, come previsto da regime fiscale di riferimento"]
[{"$nulls":20},false,"."," "]
[{"$nulls":20},false,"."," "]
{"$rows_empty":11}
[{"$nulls":21},false,"."," "]

{"sheet":"Tabella-Z1","index":5,"n_rows":38,"n_cols":18,"rows_kept":38,"hidden":true,"merged":[[0,0,0,3],[1,0,2,0],[1,1,2,1],[1,2,1,3],[3,0,10,0],[11,0,13,0],[14,0,19,0],[20,0,23,0],[24,0,25,0],[26,0,28,0],[29,0,32,0],[33,0,36,0]]}
["TAVOLA Z-1 “CATEGORIE DELLE OPERE E PARAMETRO DEL GRADO DI COMPLESSITA’”"]
["CATEGORIA D'OPERA","DESTINAZIONE FUNZIONALE DELLE OPERE","Grado di complessità G"]
[null,null,"Ridotto ","Elevato","media","Nota",null,null,1,2,3,4,5,6,7,8,9,10]
["EDILIZIA","E1-INSEDIAMENTI PRODUTTIVI PER L'AGRICOLTURA, L'INDUSTRIA, L'ARTIGIANATO-DEPOSITI",0.7,{"v":1,"d":"1.0"},{"$f":"AVERAGE(C4:D4)","v":{"v":0.85,"d":"0.9"}},{"$f":"CONCATENATE(\"(\",C4,\"-\",E4,\"-\",D4,\")\")","v":"(0,7-0,85-1)"},null,"E1",0.7,0.8,0.9,{"v":1,"d":"1.0"}]
[null,"E2-INDUSTRIA ALBERGHIERA, TURISMO E COMMERCIO E SERVIZI PER LA MOBILITA'",{"v":1,"d":"1.0"},1.3,{"$f":"AVERAGE(C5:D5)","v":{"v":1.15,"d":"1.2"}},{"$f":"CONCATENATE(\"(\",C5,\"-\",E5,\"-\",D5,\")\")","v":"(1-1,15-1,3)"},null,"E2",{"v":1,"d":"1.0"},1.1,1.2,1.3]
[null,"E3-RESIDENZA",0.7,1.3,{"v":1,"d":"1.0"},"(0,7-1-1,3)",null,"E3",0.7,0.8,0.9,{"v":1,"d":"1.0"},1.1,1.2,1.3]
[null,"E4-SANITA', ISTRUZIONE, RICERCA",{"v":1,"d":"1.0"},1.3,{"v":1.15,"d":"1.2"},"(1-1,15-1,3)",null,"E4",{"v":1,"d":"1.0"},1.1,1.2,1.3]
[null,"E5-CULTURA, VITA SOCIALE, SPORT, CULTO",{"v":1,"d":"1.0"},1.3,{"v":1.15,"d":"1.2"},"(1-1,15-1,3)",null,"E5",{"v":1,"d":"1.0"},1.1,1.2,1.3]
[null,"E6-SEDI AMMINISTRATIVE, GIUDIZIARIE, DELLE FORZE DELL'ORDINE",0.7,1.3,{"v":1,"d":"1.0"},"(0,7-1-1,3)",null,"E6",0.7,0.8,0.9,{"v":1,"d":"1.0"},1.1,1.2,1.3]
[null,"E7-ARREDI, FORNITURE, AREE ESTERNE PERTINENZIALI ALLESTITE",{"v":1,"d":"1.0"},1.3,{"v":1.15,"d":"1.2"},"(1-1,15-1,3)",null,"E7",{"v":1,"d":"1.0"},1.1,1.2,1.3]
[null,"E8-INTERVENTI SU EDIFICI E MANUFATTI DI RILEVANTE INTERESSE STORICO-ARTISTICO E MONUMENTALE",1.3,1.6,{"v":1.4500000000000002,"d":"1.5"},"(1,3-1,45-1,6)",null,"E8",1.3,1.4,1.5,1.6]
["STRUTTURE","S1-STRUTTURE, OPERE INFRASTRUTTURALI PUNTUALI, VERIFICHE NON SOGGETTE AD AZIONI SISMICHE",0.8,{"v":1,"d":"1.0"},0.9,"(0,8-0,9-1)",null,"S1",0.8,0.9,{"v":1,"d":"1.0"}]
[null,"S2-STRUTTURE, OPERE INFRASTRUTTURALI PUNTUALI, VERIFICHE SOGGETTE AD AZIONI SISMICHE ",{"v":1,"d":"1.0"},1.2,1.1,"(1-1,1-1,2)",null,"S2",{"v":1,"d":"1.0"},1.1,1.2]
[null,"S3-STRUTTURE SPECIALI",1.2,1.3,{"v":1.25,"d":"1.3"},"(1,2-1,25-1,3)",null,"S3",1.2,1.3]
["IMPIANTI","I1-IMPIANTI MECCANICI A FLUIDO A SERVIZIO DELLE COSTRUZIONI",0.8,1.1,{"v":0.9500000000000001,"d":"1.0"},"(0,8-0,95-1,1)",null,"I1",0.8,0.9,{"v":1,"d":"1.0"},1.1]
[null,"I2-IMPIANTI ELETTRICI E SPECIALI A SERVIZIO DELLE COSTRUZIONI – SINGOLE APPARECCHIATURE PER LABORATORI E IMPIANTI PILOTA",1.1,1.3,{"v":1.2000000000000002,"d":"1.2"},"(1,1-1,2-1,3)",null,"I2",1.1,1.2,1.3]
[null,"I3-IMPIANTI INDUSTRIALI - IMPIANTI PILOTA E IMPIANTI DI DEPURAZIONE CON RIDOTTE PROBLEMATICHE TECNICHE-DISCARICHE INERTI",0.6,0.8,0.7,"(0,6-0,7-0,8)",null,"I3",0.6,0.7,0.8]
[null,"I4-IMPIANTI INDUSTRIALI – IMPIANTI PILOTA E IMPIANTI DI DEPURAZIONE COMPLESSI-DISCARICHE CON TRATTAMENTI E TERMOVALORIZZATORI",0.8,1.2,{"v":1,"d":"1.0"},"(0,8-1-1,2)",null,"I4",0.8,0.9,{"v":1,"d":"1.0"},1.1,1.2]
[null,"I5-OPERE ELETTRICHE PER RETI DI TRASMISSIONE E DISTRIBUZIONE ENERGIA E SEGNALI – LABORATORI CON TRATTAMENTI E TERMOVALORIZZATORI",0.6,0.9,{"v":0.75,"d":"0.8"},"(0,6-0,75-0,9)",null,"I5",0.6,0.7,0.8,0.9]
[null,"I6-IMPANTI PER LA PRODUZIONE DI ENERGIA – LABORATORI COMPLESSI",0.9,1.1,{"v":1,"d":"1.0"},"(0,9-1-1,1)",null,"I6",0.9,{"v":1,"d":"1.0"},1.1]
["VIABILITA'","V1-MANUTENZIONE",0.4,0.5,{"v":0.45,"d":"0.5"},"(0,4-0,45-0,5)",null,"V1",0.4,0.5]
[null,"V2-VIABILITA' ORDINARIA",0.5,0.7,0.6,"(0,5-0,6-0,7)",null,"V2",0.5,0.6,0.7]
[null,"V3-NAVIGAZIONE INTERNA",0.7,0.9,0.8,"(0,7-0,8-0,9)",null,"V3",0.7,0.8,0.9]
[null,"V4-VIABILITA' SPECIALE",0.9,{"v":1,"d":"1.0"},{"v":0.95,"d":"1.0"},"(0,9-0,95-1)",null,"V4",0.9,{"v":1,"d":"1.0"}]
["IDRAULICA","D1-OPERE DI BONIFICA E DERIVAZIONI",0.4,0.6,0.5,"(0,4-0,5-0,6)",null,"D1",0.4,0.5,0.6]
[null,"D2-ACQUEDOTTI E FOGNATURE",0.6,0.8,0.7,"(0,6-0,7-0,8)",null,"D2",0.6,0.7,0.8]
["TIC","T1-SISTEMI INFORMATIVI",0.9,1.1,{"v":1,"d":"1.0"},"(0,9-1-1,1)",null,"T1",0.9,{"v":1,"d":"1.0"},1.1]
[null,"T2-SISTEMI E RETI DI TELECOMUNICAZIONE",0.7,0.9,0.8,"(0,7-0,8-0,9)",null,"T2",0.7,0.8,0.9]
[null,"T3-SISTEMI ELETTRONICI ED AUTOMAZIONE",1.1,1.3,{"v":1.2000000000000002,"d":"1.2"},"(1,1-1,2-1,3)",null,"T3",1.1,1.2,1.3]
["PAESAGGIO, AMBIENTE, NATURALIZZAZIONE","P1-INTERVENTI DI SISTEMAZIONE NATURALISTICA O PAESAGGISTICA",0.8,1.2,{"v":1,"d":"1.0"},"(0,8-1-1,2)",null,"P1",0.8,0.9,{"v":1,"d":"1.0"},1.1,1.2]
[null,"P2-INTERVENTI DEL VERDE E OPERE PER ATTIVITÀ RICREATIVA O SPORTIVA",0.7,1.1,0.9,"(0,7-0,9-1,1)",null,"P2",0.7,0.8,0.9,{"v":1,"d":"1.0"},1.1]
[null,"P3-INTERVENTI RECUPERO, RIQUALIFICAZIONE AMBIENTALE",0.9,1.3,1.1,"(0,9-1,1-1,3)",null,"P3",0.9,{"v":1,"d":"1.0"},1.1,1.2,1.3]
[null,"P4-INTERVENTI DI SFRUTTAMENTO DI CAVE E TORBIERE",0.8,1.3,{"v":1.05,"d":"1.1"},"(0,8-1,05-1,3)",null,"P4",0.8,0.9,{"v":1,"d":"1.0"},1.1,1.2,1.3]
["AGRICOLTURA E FORESTE, SICUREZZA ALIMENTARE","A1-INTERVENTI DI MIGLIORAMENTO E QUALIFICAZIONE DELLA FILIERA FORESTALE",0.7,1.2,{"v":0.95,"d":"1.0"},"(0,7-0,95-1,2)",null,"A1",0.7,0.8,0.9,{"v":1,"d":"1.0"},1.1,1.2]
[null,"A2-INTERVENTI DI MIGLIORAMENTO FONDIARIO AGRARIO E RURALE; INTERVENTI DI PIANIFICAZIONE ALIMENTARE",0.9,1.3,1.1,"(0,9-1,1-1,3)",null,"A2",0.9,{"v":1,"d":"1.0"},1.1,1.2,1.3]
[null,"A3-INTERVENTI PER LA VALORIZZAZIONE DELLE FILIERE PRODUTTIVE AGROALIMENTARI E ZOOTECNICHE; INTERVENTI DI CONTROLLO – VIGILANZA ALIMENTARE",0.8,1.2,{"v":1,"d":"1.0"},"(0,8-1-1,2)",null,"A3",0.8,0.9,{"v":1,"d":"1.0"},1.1,1.2]
[null,"A4-INTERVENTI PER LA VALORIZZAZIONE DELLA FILIERA NATURALISTICA E FAUNISTICA",0.7,1.6,{"v":1.15,"d":"1.2"},"(0,7-1,15-1,6)",null,"A4",0.7,0.8,0.9,{"v":1,"d":"1.0"},1.1,1.2,1.3,1.4,1.5,1.6]
["TERRITORIO E URBANISTICA","U1-INTERVENTI DI PIANIFICAZIONE",0.8,1.5,{"v":1.15,"d":"1.2"},"(0,8-1,15-1,5)",null,"U1",0.8,0.9,{"v":1,"d":"1.0"},1.1,1.2,1.3,1.4,1.5]